{"text_format":"3","workbook":"xlsx","n_sheets":14,"sheets":["0. Intro","1. General","2. Company Facts","3. Calc","9. Weighting","4. ECG-Matrix","5. Values","6. Stakeholder","7. Topics","8. Descr.Weighting","10. Industry","11.Region","12.ppp data","12.lan"],"not_rendered":{"charts":3,"images":6,"defined_names":6,"comments":1},"read":"whole","date_system":"1900"}

{"sheet":"0. Intro","index":0,"n_rows":41,"n_cols":13,"rows_kept":41,"merged":[[0,1,0,2],[1,1,1,3],[4,1,4,3],[5,1,5,3],[7,1,7,3],[8,1,8,2],[9,1,9,2],[10,1,10,2],[11,1,11,2],[12,1,12,2],[13,1,13,2],[14,1,14,2],[15,1,15,2],[16,1,16,2],[17,1,17,2],[18,1,18,2],[19,1,19,2],[20,1,20,2],[21,1,21,2],[22,1,22,2],[23,1,23,2],[25,1,25,3],[26,1,26,3],[28,1,28,3],[30,1,30,3],[32,1,32,3],[33,1,33,3],[34,1,34,3],[35,1,35,3],[36,1,36,3],[37,1,37,3],[39,1,39,3],[40,1,40,3]]}
[null,"Select your language"]
[null,{"$f":"'12.lan'!D4","v":"BALANCE SHEET CALCULATOR"},{"$nulls":10},{"$f":"IF('12.lan'!B2=\"\",\"\",'12.lan'!B2)","v":"Select your language"}]
[null,{"$f":"'12.lan'!D6","v":"Version"},"5.04",{"$nulls":9},{"$f":"IF('12.lan'!B3=\"\",\"\",'12.lan'!B3)","v":"Deutsch"}]
[{"$nulls":12},{"$f":"IF('12.lan'!B4=\"\",\"\",'12.lan'!B4)","v":"Italiano"}]
[null,{"$f":"'12.lan'!D7","v":"WELCOME!"},{"$nulls":10},{"$f":"IF('12.lan'!B5=\"\",\"\",'12.lan'!B5)","v":"English"}]
[null,{"$f":"'12.lan'!D8","v":"This tool is for calculating the overall Common Good Points for your company or organisation. It complements the Common Good Report and has to be used together with it. Have fun with your calculation!"},{"$nulls":10},{"$f":"IF('12.lan'!B6=\"\",\"\",'12.lan'!B6)","v":"Español"}]
{"$rows_left_out":36}
{"sheet":"1. General","index":1,"n_rows":24,"n_cols":3,"rows_kept":24,"merged":[[1,1,1,2],[2,1,2,2]]}
[]
[null,{"$f":"'12.lan'!D91&\" - \"&'0. Intro'!B3&\" \"&'0. Intro'!C3","v":"Common Good Balance Calculator - Version 5.04"}]
[null,{"$f":"'12.lan'!D62","v":"GENERAL INFORMATION ABOUT THE COMPANY"}]
[null,{"$f":"'12.lan'!D63","v":"Please complete all fields."}]
[]
[null,{"$f":"'12.lan'!D64","v":"Name of Company / Organisation:"},"company"]
{"$rows_left_out":19}
{"sheet":"2. Company Facts","index":2,"n_rows":46,"n_cols":13,"rows_kept":46,"merged":[[1,1,1,2],[2,1,2,2],[3,1,3,2],[14,1,14,2]]}
[]
[null,{"$f":"'12.lan'!D91&\" - \"&'0. Intro'!B3&\" \"&'0. Intro'!C3","v":"Common Good Balance Calculator - Version 5.04"},{"$nulls":10},{"$f":"'12.lan'!D52","v":"yes"}]
[null,{"$f":"'12.lan'!D194","v":"Company details"},{"$nulls":10},{"$f":"'12.lan'!D53","v":"no"}]
[null,{"$f":"'12.lan'!D195","v":"Fill in the highlighted fields below. Where detailed information is not available, please enter estimates, otherwise the calculation will not be accurate"}]
[]
[null,{"$f":"'12.lan'!B108","v":"A: Suppliers"}]
{"$rows_left_out":41}
{"sheet":"3. Calc","index":3,"n_rows":106,"n_cols":15,"rows_kept":106,"merged":[[1,1,1,2],[1,7,2,9],[2,1,3,3],[3,5,4,5],[3,7,4,7],[3,8,4,8],[3,9,4,9],[4,1,4,3],[6,1,6,9],[7,3,7,4],[94,1,95,6],[94,7,95,7],[94,8,95,8],[94,9,95,9]]}
[]
[null,{"$f":"'12.lan'!D91&\" - \"&'0. Intro'!B3&\" \"&'0. Intro'!C3","v":"Common Good Balance Calculator - Version 5.04"}]
[null,{"$f":"'12.lan'!D90","v":"CALCULATION OF INDIVIDUAL ASPECTS"}]
[{"$nulls":5},{"$f":"'12.lan'!D92","v":"Total Balance Score:"},null,{"$f":"I4/J4","v":{"v":0.223333333333333,"d":"22 %"}},{"$f":"IF(SUM(I9+I23+I38+I59+I76)*1000/SUM(J9+J23+J38+J59+J76)<-3600,-3600,SUM(I9+I23+I38+I59+I76)*1000/SUM(J9+J23+J38+J59+J76))","v":{"v":223.333333333333,"d":"223"}},{"$f":"SUM(J9+J23+J38+J59+J76)*1000/SUM(J9+J23+J38+J59+J76)","v":1000},null,"ausblenden",null,null,"ausblenben"]
[null,{"$f":"'12.lan'!D82&\": \"&'1. General'!C6&\"; \"&'12.lan'!D83&\": \"&'1. General'!C12","v":"Company / Organisation: company; Period under review:"}]
[]
{"$rows_left_out":101}
{"sheet":"9. Weighting","index":4,"n_rows":70,"n_cols":19,"rows_kept":70,"hidden":true,"merged":[[3,4,5,9],[3,10,6,11],[3,12,7,12],[3,13,7,13],[3,14,7,14],[3,15,7,15],[6,5,6,6],[6,7,6,8],[7,5,7,9],[9,1,13,1],[9,5,9,7],[9,9,17,9],[9,10,17,10],[9,11,17,11],[9,12,10,12],[9,13,10,13],[9,14,10,14],[9,15,10,15],[10,5,10,8],[18,5,18,7],[18,9,23,9],[18,10,23,10],[18,11,23,11],[18,12,19,12],[18,13,19,13],[18,14,19,14],[18,15,19,15],[19,5,19,7],[20,5,20,7],[21,6,21,7],[22,6,22,7],[24,5,24,7],[24,9,30,9],[24,10,30,10],[24,11,30,11],[24,12,25,12],[24,13,25,13],[24,14,25,14],[24,15,25,15],[25,5,25,7],[29,5,29,7],[30,5,30,7],[31,5,31,7],[31,9,36,9],[31,10,36,10],[31,11,36,11],[31,12,32,12],[31,13,32,13],[31,14,32,14],[31,15,32,15],[37,9,41,9],[37,10,41,10],[37,11,41,11],[37,12,38,12],[37,13,38,13],[37,14,38,14],[37,15,38,15],[44,12,45,12],[44,13,45,13],[44,14,45,14],[44,15,45,15],[48,10,48,11],[49,10,49,11],[50,10,50,11],[51,10,51,11],[52,10,52,11],[57,1,57,16]]}
[]
[]
[]
[{"$nulls":4},"MATRIX 5.0",{"$nulls":5},"VALUES WERTE",null,"1) HUMAN DIGNITY ","2) SOLIDARITY &  JUSTICE","3) ECOLOGICAL SUSTAINABILITY","4) DEMOCRATIC CO-DETERMINATION AND TRANSPARENCY"]
[null,"Total Sales (in Mio Euro)"]
[null,"Total Assets (in Mio Euro)"]
{"$rows_left_out":65}
{"sheet":"4. ECG-Matrix","index":5,"n_rows":17,"n_cols":18,"rows_kept":17,"merged":[[1,8,1,14],[2,1,3,6],[3,8,4,9],[3,10,4,11],[3,12,4,14],[5,12,5,14],[6,2,6,5],[6,6,6,9],[6,10,6,13],[6,14,6,17],[7,1,8,1],[7,2,7,5],[7,6,7,9],[7,10,7,13],[7,14,7,17],[9,1,10,1],[9,2,9,5],[9,6,9,9],[9,10,9,13],[9,14,9,17],[11,1,12,1],[11,2,11,5],[11,6,11,9],[11,10,11,13],[11,14,11,17],[13,1,14,1],[13,2,13,5],[13,6,13,9],[13,10,13,13],[13,14,13,17],[15,1,16,1],[15,2,15,5],[15,6,15,9],[15,10,15,13],[15,14,15,17]]}
[]
[null,{"$f":"'12.lan'!D91&\" - \"&'0. Intro'!B3&\" \"&'0. Intro'!C3","v":"Common Good Balance Calculator - Version 5.04"},{"$nulls":6},{"$f":"'12.lan'!D212","v":"Note: This is not a certificate."}]
[null,{"$f":"'12.lan'!D213","v":"COMMON GOOD MATRIX"}]
[{"$nulls":8},{"$f":"'12.lan'!D92","v":"Total Balance Score:"},null,{"$f":"'3. Calc'!I4","v":{"v":223.333333333333,"d":"223"}},null,{"$f":"'12.lan'!D214&\" \"&'3. Calc'!$J$4&'12.lan'!D215","v":"of 1000points"}]
[null,{"$f":"'12.lan'!D82&\": \"&'1. General'!C6&\"; \"&'12.lan'!D83&\": \"&'1. General'!C12","v":"Company / Organisation: company; Period under review:"}]
[]
{"$rows_left_out":12}
{"sheet":"5. Values","index":6,"n_rows":22,"n_cols":7,"rows_kept":22,"merged":[[1,1,1,5],[2,1,3,5],[14,1,14,5],[15,1,15,5],[16,1,16,5]]}
[]
[null,{"$f":"'12.lan'!D91&\" - \"&'0. Intro'!B3&\" \"&'0. Intro'!C3","v":"Common Good Balance Calculator - Version 5.04"}]
[null,{"$f":"'12.lan'!D241&'1. General'!C6","v":"Values star for company"}]
{"$rows_empty":13}
[null,{"$f":"'12.lan'!D221","v":"BALANCE OVERVIEW"}]
[null,{"$f":"'12.lan'!D216","v":"Human dignity"},{"$f":"'4. ECG-Matrix'!C9+'4. ECG-Matrix'!C11+'4. ECG-Matrix'!C13+'4. ECG-Matrix'!C15+'4. ECG-Matrix'!C17","v":{"v":48.8888888888889,"d":"49"}},{"$f":"'12.lan'!$D$214","v":"of"},{"$f":"'4. ECG-Matrix'!E9+'4. ECG-Matrix'!E11+'4. ECG-Matrix'!E13+'4. ECG-Matrix'!E15+'4. ECG-Matrix'!E17","v":{"v":255.555555555556,"d":"256"}},{"$f":"C18/E18","v":{"v":0.191304347826087,"d":"19 %"}},{"$f":"IF(F18<0,0,F18)","v":{"v":0.191304347826087,"d":"19 %"}}]
{"$rows_left_out":5}
{"sheet":"6. Stakeholder","index":7,"n_rows":23,"n_cols":7,"rows_kept":23,"merged":[[1,1,1,5],[2,1,3,5],[14,1,14,5],[15,1,15,5],[16,1,16,5]]}
[]
[null,{"$f":"'12.lan'!D91&\" - \"&'0. Intro'!B3&\" \"&'0. Intro'!C3","v":"Common Good Balance Calculator - Version 5.04"}]
[null,{"$f":"'12.lan'!D242&'1. General'!C6","v":"Group star for company"}]
{"$rows_empty":13}
[null,{"$f":"'12.lan'!D221","v":"BALANCE OVERVIEW"}]
[null,{"$f":"'12.lan'!D108","v":"Suppliers"},{"$f":"'3. Calc'!I9","v":40},{"$f":"'12.lan'!$D$214","v":"of"},{"$f":"'3. Calc'!J9","v":{"v":177.777777777778,"d":"178"}},{"$f":"C18/E18","v":{"v":0.225,"d":"23 %"}},{"$f":"IF(F18<0,0,F18)","v":{"v":0.225,"d":"23 %"}}]
{"$rows_left_out":6}
{"sheet":"7. Topics","index":8,"n_rows":38,"n_cols":7,"rows_kept":38,"merged":[[1,1,1,5],[2,1,3,5],[14,1,14,5],[15,1,15,5],[16,1,16,5]]}
[]
[null,{"$f":"'12.lan'!D91&\" - \"&'0. Intro'!B3&\" \"&'0. Intro'!C3","v":"Common Good Balance Calculator - Version 5.04"}]
[null,{"$f":"'12.lan'!D243&'1. General'!C6","v":"Theme star for company"}]
{"$rows_empty":13}
[null,{"$f":"'12.lan'!D221","v":"BALANCE OVERVIEW"}]
[null,"A1",{"$f":"'4. ECG-Matrix'!C9","v":{"v":4.44444444444444,"d":"4"}},{"$f":"'12.lan'!$D$214","v":"of"},{"$f":"'4. ECG-Matrix'!E9","v":{"v":44.4444444444444,"d":"44"}},{"$f":"C18/E18","v":{"v":0.1,"d":"10 %"}},{"$f":"IF(F18<0,0,F18)","v":{"v":0.1,"d":"10 %"}}]
{"$rows_left_out":21}
{"sheet":"8. Descr.Weighting","index":9,"n_rows":26,"n_cols":3,"rows_kept":26,"merged":[[1,0,1,2]]}
[{"$f":"'12.lan'!D91&\" - \"&'0. Intro'!B3&\" \"&'0. Intro'!C3","v":"Common Good Balance Calculator - Version 5.04"}]
[{"$f":"'12.lan'!D204","v":"Description of the weighting model"}]
[]
[{"$f":"'12.lan'!D208","v":"General"},null,{"$f":"'12.lan'!D244","v":"The allocation of equal and fixed scores for all companies has been the subject of much discussion within the Matrix-development team during the past few years. Outside sources have also raised many questions and provided feedback. Untill now, the way points are distributed for themes has been the same for all companies (with the exception of one-person companies), regardless of company size, industry and other parameters (regional background, B2B versus B2C, etc.). However, these variables may well have an effect on the relevance to and effect on the common good.For example, the supply chain of an electronics trading company (A1-A4) is more significant than for a mining company, which, in turn, leaves a huge, direct environmental impact, amongst other things (E3). The new weighting model addresses these issues and highlights the significant factors. A survey on the changes was conducted, with feedback clearly favouring a new approach."}]
[{"$f":"'12.lan'!D207","v":"Stakekolders & values"},null,{"$f":"'12.lan'!D245","v":"For the weighting of three stakeholder groups, A) suppliers, B) investors and C) employees, the matrix takes into account the following financial flows to these stakeholders: A) procurement expenditure, B) profit and borrowing costs C) wages and salaries. We are aware of the limited significance attached to money in the current matrix and have plans for how this can be improved in the future. At the same time, this information is readily available in companies' financial balance sheets, and easily meets the needs of many companies. Since taxes and borrowing costs are included in procurement expenditure, these account for only 50% of the weighting."}]
[{"$f":"'12.lan'!D205","v":"Themes"},null,{"$f":"'12.lan'!D246","v":"There are also criteria for the weighting of the themes, for example a company's size or industry or the relevant local employment law. The United Nations' International Standard Industrial Classification of All Economic Activities (ISIC Rev.4) is used for all industry sector definitions. For size classification, definitions as set out by the EU are used. The table below summarises the current weighting factors (as at May 2017):"}]
{"$rows_left_out":21}
{"sheet":"10. Industry","index":10,"n_rows":39,"n_cols":17,"rows_kept":39,"hidden":true,"merged":[[0,0,0,16],[1,2,1,3],[1,4,1,5],[1,6,1,7],[1,8,1,9],[1,10,1,11],[1,12,1,13],[1,14,1,16],[1,17,1,18]]}
["INDUSTRY WEIGHTING - COMMON GOOD MATRIX"]
[null,"INDUSTRY ",null,null,"A1 -social risks in the Supply Chain",null,"A3 -ecological sustainability in the Supply Chain",null,"D3 - Ecological Design of products and services",null,"E3 -  Reduction of Environmental Impact",null,"E4 - Social transparency and co-\ndetermination",null,"A3 - Ecologicla Supply Chain Risk"]
[null,"(based UN International Standard Industrial Classification of All Economic Activities, Rev.4 -http://unstats.un.org/unsd/cr/registry/regcst.asp?Cl=27)",null,null,"weighting","argumentation: based on the social risks in the industry","weighting","argumentation: based on ecological impact on the planterary boundaries in the supply cahin (studies and the use of quantitative models - e.g. ecological footprint - will be applied herefor)","weighting","argumentation: based on the products / service impact on the planterary boundaries in the use phase (studies and the use of quantitative models - e.g. ecological footprint - will be applied herefor)","weighting","argumentation: based on the sectors direct impact in the production phase on the planterary boundaries (studies and the use of quantitative models will be applied herefor); e.g. sehr hoch: The sector has a major impact of various planetary boundaries","weighting","argumentation: the weighting is depending on the impact the industry has particularly on the adjacent environment\n",null,"weighting","argumentation: based on the sectors direct impact in the production phase on the planterary boundaries (studies and the use of quantitative models will be applied herefor)\nsehr hoch: The sector has a major impact of various planetary boundaries"]
["A ",{"$f":"'12.lan'!D268","v":"A - agriculture, forestry management, fishing industry"},null,null,"sehr hoch",null,null,"ist E3?","mittel","the main impacts are in the production phase","sehr hoch","major direct impact on various planetary boundaries in the production (climate change, N/P-cycle, biodiversity, land-use-change) ","mittel",null,null,"sehr hoch"]
["B ",{"$f":"'12.lan'!D269","v":"B - Mining and quarrying"},null,null,"sehr hoch",{"$nulls":3},"mittel",null,"sehr hoch","major impact on eco-systems","sehr hoch",null,null,"sehr hoch"]
["C ",{"$f":"'12.lan'!D270","v":"C - Manufacturing industries (not further specified)"},null,null,"hoch",{"$nulls":3},"mittel",null,"hoch","Please note: This industry is very heterogen. ","hoch",null,null,"hoch"]
{"$rows_left_out":34}
{"sheet":"11.Region","index":11,"n_rows":243,"n_cols":17,"rows_kept":243,"hidden":true,"merged":[[0,0,0,6],[1,11,1,13],[1,14,1,16],[2,1,7,1],[2,6,7,6],[7,9,7,12]]}
["SUPPLIERS AND EMPLOYEE WEIGHTING RATIO"]
[null,"added value of suppliers (source: income statement)","Splitted added value (source¿?)","Country","PPP index (source¿?)","Added value adjusted","Total","%","ITUC (average)","Industry","nace","ecol. Impact (A3)",null,null,"social impact (A1)"]
["Supplier 1",{"$f":"'9. Weighting'!I10","v":{"v":10000,"d":"10,000"}},{"$f":"'9. Weighting'!I13","v":500},{"$f":"'9. Weighting'!H13","v":"Please choose"},{"$f":"IFERROR(VLOOKUP(D3,$A$22:$G$400,3,FALSE()),$C$243)","v":{"v":0.978035862587365,"d":"0.98"}},{"$f":"IFERROR(C3*E3,\"0\")","v":{"v":489.017931293682,"d":"489"}},{"$f":"SUM(F3:F8)","v":{"v":9780.35862587365,"d":"9,780"}},{"$f":"IFERROR(F3/$G$3,\"-\")","v":{"v":0.05,"d":"5 %"}},{"$f":"IFERROR(VLOOKUP(D3,$A$21:$I$134,6,FALSE()),2.99)","v":2.99},{"$f":"'9. Weighting'!E13","v":"Pl"},{"$f":"'9. Weighting'!G13","v":"Please enter"},{"$f":"IFERROR(VLOOKUP(J3,'10. Industry'!$A$4:$P$32,16,FALSE()),'3. Calc'!C104)","v":1},{"$f":"VLOOKUP(L3,'9. Weighting'!$F$49:$H$53,3,FALSE())","v":{"$error":"#N/A"}},{"$f":"M3*H3","v":{"$error":"#N/A"}},{"$f":"IFERROR(VLOOKUP(J3,'10. Industry'!$A$4:$N$32,5,FALSE()),'3. Calc'!C104)","v":1},{"$f":"VLOOKUP(O3,'9. Weighting'!$F$49:$H$53,3,FALSE())","v":{"$error":"#N/A"}},{"$f":"P3*H3","v":{"$error":"#N/A"}}]
["Supplier 2",null,{"$f":"'9. Weighting'!I14","v":0},{"$f":"'9. Weighting'!H14","v":"Please choose"},{"$f":"IFERROR(VLOOKUP(D4,$A$22:$G$400,3,FALSE()),$C$243)","v":{"v":0.978035862587365,"d":"0.98"}},{"$f":"IFERROR(C4*E4,\"0\")","v":0},null,{"$f":"IFERROR(F4/$G$3,\"-\")","v":{"v":0,"d":"0 %"}},{"$f":"IFERROR(VLOOKUP(D4,$A$21:$I$134,6,FALSE()),2.99)","v":2.99},{"$f":"'9. Weighting'!E14","v":"Pl"},{"$f":"'9. Weighting'!G14","v":"Please enter"},{"$f":"IFERROR(VLOOKUP(J4,'10. Industry'!$A$4:$P$32,16,FALSE()),'3. Calc'!C104)","v":1},{"$f":"VLOOKUP(L4,'9. Weighting'!$F$49:$H$53,3,FALSE())","v":{"$error":"#N/A"}},{"$f":"M4*H4","v":{"$error":"#N/A"}},{"$f":"IFERROR(VLOOKUP(J4,'10. Industry'!$A$4:$N$32,5,FALSE()),'3. Calc'!C104)","v":1},{"$f":"VLOOKUP(O4,'9. Weighting'!$F$49:$H$53,3,FALSE())","v":{"$error":"#N/A"}},{"$f":"P4*H4","v":{"$error":"#N/A"}}]
["Supplier 3",null,{"$f":"'9. Weighting'!I15","v":0},{"$f":"'9. Weighting'!H15","v":"Please choose"},{"$f":"IFERROR(VLOOKUP(D5,$A$22:$G$400,3,FALSE()),$C$243)","v":{"v":0.978035862587365,"d":"0.98"}},{"$f":"IFERROR(C5*E5,\"0\")","v":0},null,{"$f":"IFERROR(F5/$G$3,\"-\")","v":{"v":0,"d":"0 %"}},{"$f":"IFERROR(VLOOKUP(D5,$A$21:$I$134,6,FALSE()),2.99)","v":2.99},{"$f":"'9. Weighting'!E15","v":"Pl"},{"$f":"'9. Weighting'!G15","v":"Please enter"},{"$f":"IFERROR(VLOOKUP(J5,'10. Industry'!$A$4:$P$32,16,FALSE()),'3. Calc'!C104)","v":1},{"$f":"VLOOKUP(L5,'9. Weighting'!$F$49:$H$53,3,FALSE())","v":{"$error":"#N/A"}},{"$f":"M5*H5","v":{"$error":"#N/A"}},{"$f":"IFERROR(VLOOKUP(J5,'10. Industry'!$A$4:$N$32,5,FALSE()),'3. Calc'!C104)","v":1},{"$f":"VLOOKUP(O5,'9. Weighting'!$F$49:$H$53,3,FALSE())","v":{"$error":"#N/A"}},{"$f":"P5*H5","v":{"$error":"#N/A"}}]
["Supplier 4",null,{"$f":"'9. Weighting'!I16","v":0},{"$f":"'9. Weighting'!H16","v":"Please choose"},{"$f":"IFERROR(VLOOKUP(D6,$A$22:$G$400,3,FALSE()),$C$243)","v":{"v":0.978035862587365,"d":"0.98"}},{"$f":"IFERROR(C6*E6,\"0\")","v":0},null,{"$f":"IFERROR(F6/$G$3,\"-\")","v":{"v":0,"d":"0 %"}},{"$f":"IFERROR(VLOOKUP(D6,$A$21:$I$134,6,FALSE()),2.99)","v":2.99},{"$f":"'9. Weighting'!E16","v":"Pl"},{"$f":"'9. Weighting'!G16","v":"Please enter"},{"$f":"IFERROR(VLOOKUP(J6,'10. Industry'!$A$4:$P$32,16,FALSE()),'3. Calc'!C104)","v":1},{"$f":"VLOOKUP(L6,'9. Weighting'!$F$49:$H$53,3,FALSE())","v":{"$error":"#N/A"}},{"$f":"M6*H6","v":{"$error":"#N/A"}},{"$f":"IFERROR(VLOOKUP(J6,'10. Industry'!$A$4:$N$32,5,FALSE()),'3. Calc'!C104)","v":1},{"$f":"VLOOKUP(O6,'9. Weighting'!$F$49:$H$53,3,FALSE())","v":{"$error":"#N/A"}},{"$f":"P6*H6","v":{"$error":"#N/A"}}]
{"$rows_left_out":238}
{"sheet":"12.ppp data","index":12,"n_rows":266,"n_cols":12,"rows_kept":266,"hidden":true}
[]
[null,null,"Country Name","Exchange Rate $ 2017","Exchange Rate country 2017 (oanda)","ppp gdp conversion factor 2017","conversion factor","Region",null,"est","Regional Estimate calculationen"]
[null,null,"Sao Tome and Principe",{"v":1.12949,"d":"1.129 "},null,{"v":12463.5635198013,"d":"12,463.564 "},{"$f":"D3*E3/F3","v":0},{"$f":"VLOOKUP(C3,'11.Region'!$B$22:$E$243,4,FALSE())","v":"Africa"},{"$f":"$K$3","v":{"v":3.03256163278312,"d":"3.03 "}},"est",{"$f":"AVERAGE(G5:G51)","v":{"v":3.03256163278312,"d":"3.03 "}},"Africa"]
[null,null,"Zimbabwe",{"v":1.12949,"d":"1.129 "},null,{"v":0.51762968529526,"d":"0.518 "},{"$f":"D4*E4/F4","v":0},{"$f":"VLOOKUP(C4,'11.Region'!$B$22:$E$243,4,FALSE())","v":"Africa"},{"$f":"$K$3","v":{"v":3.03256163278312,"d":"3.03 "}},"est"]
[null,null,"Angola",{"v":1.12949,"d":"1.129 "},{"v":165.09042,"d":"165.090 "},{"v":108.299425238122,"d":"108.299 "},{"$f":"D5*E5/F5","v":{"v":1.72178179224687,"d":"1.72 "}},{"$f":"VLOOKUP(C5,'11.Region'!$B$22:$E$243,4,FALSE())","v":"Africa"},{"$f":"G5","v":{"v":1.72178179224687,"d":"1.72 "}}]
[null,null,"Sudan",{"v":1.12949,"d":"1.129 "},{"v":6.60668,"d":"6.607 "},{"v":4.13776545849889,"d":"4.138 "},{"$f":"D6*E6/F6","v":{"v":1.80343208624182,"d":"1.80 "}},{"$f":"VLOOKUP(C6,'11.Region'!$B$22:$E$243,4,FALSE())","v":"Africa"},{"$f":"G6","v":{"v":1.80343208624182,"d":"1.80 "}}]
{"$rows_left_out":261}
{"sheet":"12.lan","index":13,"n_rows":561,"n_cols":13,"rows_kept":561,"hidden":true}
[null,null,{"$f":"VLOOKUP('0. Intro'!B1,'12.lan'!B2:C12,2,FALSE())","v":3},{"$f":"HLOOKUP($C$1,$E$1:$X$4910,ROW(D1))","v":3},1,2,3,4,5,6,7]
[3,"Select your language",{"$f":"A2","v":3},{"$f":"HLOOKUP($C$1,$E$1:$X$4910,ROW(D2))","v":"English"},"Deutsch","Italiano","English","Español","Francais","Portugues","Griechisch"]
[1,"Deutsch",{"$f":"A3","v":1},{"$f":"HLOOKUP($C$1,$E$1:$X$4910,ROW(D3))","v":0}]
[2,"Italiano",{"$f":"A4","v":2},{"$f":"HLOOKUP($C$1,$E$1:$X$4910,ROW(D4))","v":"BALANCE SHEET CALCULATOR"},"GEMEINWOHL-RECHNER","Calcolatore del Bene Comune","BALANCE SHEET CALCULATOR","CALCULADORA DEL BIEN COMÚN",{"$f":"\"[fr]\"&E4","v":"[fr]GEMEINWOHL-RECHNER"},{"$f":"\"[pt]\"&E4","v":"[pt]GEMEINWOHL-RECHNER"},{"$f":"\"[gr]\"&E4","v":"[gr]GEMEINWOHL-RECHNER"}]
[3,"English",{"$f":"A5","v":3},{"$f":"HLOOKUP($C$1,$E$1:$X$4910,ROW(D5))","v":"© ECG"},"© GWÖ","© Economia del Bene Comune","© ECG","© Economía del Bien Común",{"$f":"\"[fr]\"&E5","v":"[fr]© GWÖ"},{"$f":"\"[pt]\"&E5","v":"[pt]© GWÖ"},{"$f":"\"[gr]\"&E5","v":"[gr]© GWÖ"}]
[4,"Español",{"$f":"A6","v":4},{"$f":"HLOOKUP($C$1,$E$1:$X$4910,ROW(D6))","v":"Version"},"Version","Versione","Version","Versión",{"$f":"\"[fr]\"&E6","v":"[fr]Version"},"Versão",{"$f":"\"[gr]\"&E6","v":"[gr]Version"}]
{"$rows_left_out":555}