{"text_format":"3","workbook":"xlsx","n_sheets":14,"sheets":["0. Intro","1. General","2. Company Facts","3. Calc","9. Weighting","4. ECG-Matrix","5. Values","6. Stakeholder","7. Topics","8. Descr.Weighting","10. Industry","11.Region","12.ppp data","12.lan"],"not_rendered":{"charts":3,"images":6,"defined_names":6,"comments":1},"read":"whole","date_system":"1900"}

{"sheet":"0. Intro","index":0,"n_rows":41,"n_cols":13,"rows_kept":41,"merged":[[0,1,0,2],[1,1,1,3],[4,1,4,3],[5,1,5,3],[7,1,7,3],[8,1,8,2],[9,1,9,2],[10,1,10,2],[11,1,11,2],[12,1,12,2],[13,1,13,2],[14,1,14,2],[15,1,15,2],[16,1,16,2],[17,1,17,2],[18,1,18,2],[19,1,19,2],[20,1,20,2],[21,1,21,2],[22,1,22,2],[23,1,23,2],[25,1,25,3],[26,1,26,3],[28,1,28,3],[30,1,30,3],[32,1,32,3],[33,1,33,3],[34,1,34,3],[35,1,35,3],[36,1,36,3],[37,1,37,3],[39,1,39,3],[40,1,40,3]]}
[null,"Select your language"]
[null,{"$f":"'12.lan'!D4","v":"BALANCE SHEET CALCULATOR"},{"$nulls":10},{"$f":"IF('12.lan'!B2=\"\",\"\",'12.lan'!B2)","v":"Select your language"}]
[null,{"$f":"'12.lan'!D6","v":"Version"},"5.04",{"$nulls":9},{"$f":"IF('12.lan'!B3=\"\",\"\",'12.lan'!B3)","v":"Deutsch"}]
[{"$nulls":12},{"$f":"IF('12.lan'!B4=\"\",\"\",'12.lan'!B4)","v":"Italiano"}]
[null,{"$f":"'12.lan'!D7","v":"WELCOME!"},{"$nulls":10},{"$f":"IF('12.lan'!B5=\"\",\"\",'12.lan'!B5)","v":"English"}]
[null,{"$f":"'12.lan'!D8","v":"This tool is for calculating the overall Common Good Points for your company or organisation. It complements the Common Good Report and has to be used together with it. Have fun with your calculation!"},{"$nulls":10},{"$f":"IF('12.lan'!B6=\"\",\"\",'12.lan'!B6)","v":"Español"}]
[{"$nulls":12},{"$f":"IF('12.lan'!B7=\"\",\"\",'12.lan'!B7)","v":"Francais"}]
[null,{"$f":"'12.lan'!D9","v":"HOW TO USE THE BALANCE SHEET CALCULATOR:"},{"$nulls":10},{"$f":"IF('12.lan'!B8=\"\",\"\",'12.lan'!B8)","v":"Portugues"}]
[null,{"$f":"'12.lan'!D10","v":"1. General"},null,{"$f":"'12.lan'!D11","v":"You can enter general information about your company or organisation in this section."},{"$nulls":8},{"$f":"IF('12.lan'!B9=\"\",\"\",'12.lan'!B9)","v":"Griechisch"}]
[null,{"$f":"'12.lan'!D28","v":"2. Company details"},null,{"$f":"'12.lan'!D12","v":"All fields in this section must be completed as they are essential for the weighting of each theme."},{"$nulls":8},{"$f":"IF('12.lan'!B10=\"\",\"\",'12.lan'!B10)","v":""}]
[null,{"$f":"'12.lan'!D29","v":"3. Scoring"},null,{"$f":"'12.lan'!D13","v":"For each theme (A1, B1, ...) a certain maximum number of Common Good Points can be achieved. To evaluate how many points your company scores, follow these steps:"},{"$nulls":8},{"$f":"IF('12.lan'!B11=\"\",\"\",'12.lan'!B11)","v":""}]
[null,"a)",null,{"$f":"'12.lan'!D14","v":"Describe the current status and potential for improvement for the various aspects under key headings. Use the workbook as a reference. (This is optional and not absolutely necessary for the calculation.)"},{"$nulls":8},{"$f":"IF('12.lan'!B12=\"\",\"\",'12.lan'!B12)","v":""}]
[null,"b)",null,{"$f":"'12.lan'!D15","v":"Based on these descriptions, indicate on a scale of 0-10 how far you consider the respective aspect is met (Achievement level). The criteria for choosing the correct value can be found in the Workbook."}]
[null,"c)",null,{"$f":"'12.lan'!D16","v":"Negative aspects are allocated negative points according to the descriptions set out in the Workbook."}]
[null,"d)",null,{"$f":"'12.lan'!D17","v":"Where deemed necessary for your company and in agreement with the auditors you can change the relative weightings of individual aspects (A1.1, A1.2, ..). In the column Weighting, you can select values for each aspect. The distribution of available points for individual aspects will then be adjusted automatically, so that the total of all aspects of an indicator result in 100%."}]
[null,"e)",null,{"$f":"'12.lan'!D18","v":"The calculation automatically weights each theme’s total value against the data in the ‘Company details’ section and rounds it to a whole-number multiple of 10%."}]
[null,{"$f":"'12.lan'!D30","v":"4. ECG Matrix"},null,{"$f":"'12.lan'!D19","v":"The ECG-Matrix displays your result in a table."}]
[null,{"$f":"'12.lan'!D31","v":"5. Values star"},null,{"$f":"'12.lan'!D21","v":"The values-star displays your result arranged by value as a graphic."}]
[null,{"$f":"'12.lan'!D32","v":"6. Group star"},null,{"$f":"'12.lan'!D22","v":"The group-star displays your result arranged by stakeholder as a graphic."}]
[null,{"$f":"'12.lan'!D33","v":"7. Theme star"},null,{"$f":"'12.lan'!D23","v":"The theme-star displays the result of your themes as a graphic."}]
[null,{"$f":"'12.lan'!D34","v":"8. Weighting model description"},null,{"$f":"'12.lan'!D24","v":"This is a description of the weighting model."}]
[null,{"$f":"'12.lan'!D35","v":"9. Weighting (hidden)"},null,{"$f":"'12.lan'!D25","v":"This is where the calculation determines how the individual stakeholder groups and themes are weighted."}]
[null,{"$f":"'12.lan'!D36","v":"10. Industry sectors (hidden)"},null,{"$f":"'12.lan'!D26","v":"This contains an assessment of the relevance of supply chains and environmental sustainability for all industry sectors, used in the weighting."}]
[null,{"$f":"'12.lan'!D37","v":"11. Countries (hidden)"},null,{"$f":"'12.lan'!D27","v":"This contains statistics for countries and regions used in the weighting."}]
[]
[null,{"$f":"'12.lan'!D40","v":"KEY"}]
[null,{"$f":"'12.lan'!D41","v":"Field is editable (green frame, dark green text)"}]
[]
[null,{"$f":"'12.lan'!D42","v":"Feld is read-only (grey frame, dark grey text)"}]
[]
[null,{"$f":"'12.lan'!D43","v":"non valid value entry (for correct calculation change value)"}]
[]
[null,{"$f":"'12.lan'!D54","v":"CONTACT"}]
[null,{"$f":"'12.lan'!D55","v":"Questions regarding preparation of balance sheet:\nberatung@gemeinwohl-oekonomie.org (GWÖ-BeraterInnen);"}]
[null,{"$f":"'12.lan'!D56","v":"Questions regarding audit: audit@gemeinwohl-oekonomie.org (GWÖ-AuditorInnen);"}]
[null,{"$f":"'12.lan'!D57","v":"Feedback on the development of the Matrix: bilanz@ecogood.org (Matrix Development Team)"}]
[null,{"$f":"'12.lan'!D58","v":"Excel programming: Christian Loy (christian.loy@gmx.at); Christian Kozina; Multilanguage tool: Bernhard Oberrauch"}]
[null,{"$f":"'12.lan'!D59","v":"Contents: ECG-Matrix Development Team"}]
[]
[null,{"$f":"'12.lan'!D60","v":"NOTES"}]
[null,{"$f":"'12.lan'!D61","v":"All sheets are optimised for printing on A4 format (landscape or portrait).\nThe height of rows can be adjusted, if you enter more text"}]

{"sheet":"1. General","index":1,"n_rows":24,"n_cols":3,"rows_kept":24,"merged":[[1,1,1,2],[2,1,2,2]]}
[]
[null,{"$f":"'12.lan'!D91&\" - \"&'0. Intro'!B3&\" \"&'0. Intro'!C3","v":"Common Good Balance Calculator - Version 5.04"}]
[null,{"$f":"'12.lan'!D62","v":"GENERAL INFORMATION ABOUT THE COMPANY"}]
[null,{"$f":"'12.lan'!D63","v":"Please complete all fields."}]
[]
[null,{"$f":"'12.lan'!D64","v":"Name of Company / Organisation:"},"company"]
[null,{"$f":"'12.lan'!D65","v":"Address:"},"adresse"]
[null,{"$f":"'12.lan'!D66","v":"Country:"},"germany"]
[null,{"$f":"'12.lan'!D67","v":"Industry sector:"},"a sector"]
[null,{"$f":"'12.lan'!D68","v":"Website:"},"foo.bar.de"]
[]
[null,{"$f":"'12.lan'!D83","v":"Period under review"}]
[]
[null,{"$f":"'12.lan'!D73","v":"Document created by:"},"Mr Smith"]
[null,{"$f":"'12.lan'!D74","v":"Email address:"},"mail@bla.com"]
[null,{"$f":"'12.lan'!D75","v":"Phone number:"}]
[]
[null,{"$f":"'12.lan'!D76","v":"Consultant:"}]
[null,{"$f":"'12.lan'!D74","v":"Email address:"}]
[null,{"$f":"'12.lan'!D75","v":"Phone number:"}]
[]
[null,{"$f":"'12.lan'!D79","v":"Short description of Company / Organisation"},"this is just a description"]
[]
[null,{"$f":"'12.lan'!D80","v":"Additional comments:"},"comments for some bla…"]

{"sheet":"2. Company Facts","index":2,"n_rows":46,"n_cols":13,"rows_kept":46,"merged":[[1,1,1,2],[2,1,2,2],[3,1,3,2],[14,1,14,2]]}
[]
[null,{"$f":"'12.lan'!D91&\" - \"&'0. Intro'!B3&\" \"&'0. Intro'!C3","v":"Common Good Balance Calculator - Version 5.04"},{"$nulls":10},{"$f":"'12.lan'!D52","v":"yes"}]
[null,{"$f":"'12.lan'!D194","v":"Company details"},{"$nulls":10},{"$f":"'12.lan'!D53","v":"no"}]
[null,{"$f":"'12.lan'!D195","v":"Fill in the highlighted fields below. Where detailed information is not available, please enter estimates, otherwise the calculation will not be accurate"}]
[]
[null,{"$f":"'12.lan'!B108","v":"A: Suppliers"}]
[null,{"$f":"'12.lan'!D297","v":"Total purchases from suppliers (in Euros):"},{"v":10000,"d":"10,000"},{"$f":"IF(SUM(F10:F14)>C7,'12.lan'!D44,\"\")","v":""}]
[null,{"$f":"'12.lan'!D298","v":"Enter the 5 most important industry sectors whose products or services you use."}]
[null,{"$f":"'12.lan'!D299","v":"Industry sector"},{"$f":"'12.lan'!D300","v":"Description"},{"$f":"'12.lan'!D301","v":"Region of origin"},null,{"$f":"'12.lan'!D302","v":"Costs"}]
[null,{"$f":"'12.lan'!$D$203","v":"Please choose"},{"$f":"'12.lan'!$D$202","v":"Please enter"},{"$f":"'12.lan'!$D$203","v":"Please choose"},null,500]
[null,{"$f":"'12.lan'!$D$203","v":"Please choose"},{"$f":"'12.lan'!$D$202","v":"Please enter"},{"$f":"'12.lan'!$D$203","v":"Please choose"},null,0]
[null,{"$f":"'12.lan'!$D$203","v":"Please choose"},{"$f":"'12.lan'!$D$202","v":"Please enter"},{"$f":"'12.lan'!$D$203","v":"Please choose"},null,0]
[null,{"$f":"'12.lan'!$D$203","v":"Please choose"},{"$f":"'12.lan'!$D$202","v":"Please enter"},{"$f":"'12.lan'!$D$203","v":"Please choose"},null,0]
[null,{"$f":"'12.lan'!$D$203","v":"Please choose"},{"$f":"'12.lan'!$D$202","v":"Please enter"},{"$f":"'12.lan'!$D$203","v":"Please choose"},null,0]
[null,{"$f":"'12.lan'!$D$303","v":"Main origin of the other suppliers"},null,{"$f":"'12.lan'!$D$203","v":"Please choose"},null,{"$f":"C7-F10-F11-F12-F13-F14","v":{"v":9500,"d":"9,500"}}]
[]
[null,{"$f":"'12.lan'!B122","v":"B: Owners, equity- and financial service providers"}]
[null,{"$f":"'12.lan'!D304","v":"Profit"},500]
[null,{"$f":"'12.lan'!D305","v":"Financing costs"},12]
[null,{"$f":"'12.lan'!D306","v":"Income from financial investments"},23]
[null,{"$f":"'12.lan'!D307","v":"Total assets"},44]
[null,{"$f":"'12.lan'!D308","v":"Additions to fixed-assets"},55]
[null,{"$f":"'12.lan'!D309","v":"Financial assets and cash balance"},66]
[]
[null,{"$f":"'12.lan'!B137","v":"C: Employees"}]
[null,{"$f":"'12.lan'!D310","v":"Number of employees (full time equivalents)"},{"v":1234,"d":"1,234"}]
[null,{"$f":"'12.lan'!D311","v":"Staff costs (gross without employer contribution)"},{"v":33333,"d":"33,333"}]
[null,{"$f":"'12.lan'!D312","v":"Enter the 3 countries and regions where most of the staff are"}]
[null,{"$f":"'12.lan'!D313","v":"Country and region"},null,{"$f":"'12.lan'!D314","v":"Amount in %"}]
[null,{"$f":"'12.lan'!$D$203","v":"Please choose"},null,{"v":0,"d":"0 %"},{"$f":"IF(SUM(D30:D32)>\"100%\",\"fehlerhafte Eingabe\",\"\")","v":""}]
[null,{"$f":"'12.lan'!$D$203","v":"Please choose"},null,{"v":0,"d":"0 %"}]
[null,{"$f":"'12.lan'!$D$203","v":"Please choose"},null,{"v":0,"d":"0 %"}]
[null,{"$f":"'12.lan'!D315","v":"Average journey to work for staff (in km)"},0]
[null,{"$f":"'12.lan'!D316","v":"Is there a canteen for the majority of staff?"},null,"Ja",null,"Nein"]
[]
[null,{"$f":"'12.lan'!B158","v":"D: Customers and other companies"}]
[null,{"$f":"'12.lan'!D317","v":"Turnover (in Euros)"}]
[null,{"$f":"'12.lan'!D318","v":"Are your customers mainly other companies?"}]
[null,{"$f":"'12.lan'!D319","v":"Enter the 3 most important industry sectors which your company is active in, including a rough share of turnover"}]
[null,{"$f":"'12.lan'!D320","v":"Industry sector"},{"$f":"'12.lan'!D321","v":"Description"},{"$f":"'12.lan'!D322","v":"% Amount of total turnover"}]
[null,{"$f":"'12.lan'!$D$203","v":"Please choose"},null,{"v":0,"d":"0 %"},null,{"$f":"IF(SUM(D41:D43)>\"100%\",\"fehlerhafte Eingabe\",\"\")","v":""}]
[null,{"$f":"'12.lan'!$D$203","v":"Please choose"},null,{"v":0,"d":"0 %"}]
[null,{"$f":"'12.lan'!$D$203","v":"Please choose"},null,{"v":0,"d":"0 %"},null,{"$f":"IF(SUM(D41:D43)>1,'12.lan'!D44,\"\")","v":""}]
[]
[null,{"$f":"'12.lan'!B175","v":"E: Social environment"}]
[null,{"$f":"'12.lan'!D323","v":"Company size"},{"$f":"'9. Weighting'!H39","v":"Large business"}]

{"sheet":"3. Calc","index":3,"n_rows":106,"n_cols":15,"rows_kept":106,"merged":[[1,1,1,2],[1,7,2,9],[2,1,3,3],[3,5,4,5],[3,7,4,7],[3,8,4,8],[3,9,4,9],[4,1,4,3],[6,1,6,9],[7,3,7,4],[94,1,95,6],[94,7,95,7],[94,8,95,8],[94,9,95,9]]}
[]
[null,{"$f":"'12.lan'!D91&\" - \"&'0. Intro'!B3&\" \"&'0. Intro'!C3","v":"Common Good Balance Calculator - Version 5.04"}]
[null,{"$f":"'12.lan'!D90","v":"CALCULATION OF INDIVIDUAL ASPECTS"}]
[{"$nulls":5},{"$f":"'12.lan'!D92","v":"Total Balance Score:"},null,{"$f":"I4/J4","v":{"v":0.223333333333333,"d":"22 %"}},{"$f":"IF(SUM(I9+I23+I38+I59+I76)*1000/SUM(J9+J23+J38+J59+J76)<-3600,-3600,SUM(I9+I23+I38+I59+I76)*1000/SUM(J9+J23+J38+J59+J76))","v":{"v":223.333333333333,"d":"223"}},{"$f":"SUM(J9+J23+J38+J59+J76)*1000/SUM(J9+J23+J38+J59+J76)","v":1000},null,"ausblenden",null,null,"ausblenben"]
[null,{"$f":"'12.lan'!D82&\": \"&'1. General'!C6&\"; \"&'12.lan'!D83&\": \"&'1. General'!C12","v":"Company / Organisation: company; Period under review:"}]
[]
[]
[null,{"$f":"'12.lan'!D93","v":"No."},{"$f":"'12.lan'!D107","v":"Stakeholders/ Themes/ Aspects"},{"$f":"'12.lan'!D96","v":"Weight"},null,{"$f":"'12.lan'!D102","v":"Current status"},null,{"$f":"'12.lan'!D104","v":"Est%"},{"$f":"'12.lan'!D105","v":"Points"},{"$f":"'12.lan'!D106","v":"Max."},null,"Gewichtung Standard",null,null,"Reset"]
[null,"A",{"$f":"'12.lan'!D108","v":"Suppliers"},{"$f":"L9","v":{"v":1,"d":"1.0"}},{"$f":"VLOOKUP(D9,$C$102:$D$106,2,FALSE())","v":"medium"},null,null,{"$f":"IFERROR(I9/J9,0)","v":{"v":0.225,"d":"23 %"}},{"$f":"I10+I13+I17+I20","v":40},{"$f":"J10+J13+J17+J20","v":{"v":177.777777777778,"d":"178"}},null,{"$f":"'9. Weighting'!K49","v":1},null,{"$f":"IF(D9<>L9,'12.lan'!$D$240&VLOOKUP(L9,$C$102:$D$106,2,FALSE())&\" (\"&L9&\")\",\"\")","v":""}]
[null,"A1",{"$f":"'12.lan'!D109","v":"Human dignity in the supply chain"},{"$f":"IF(K10=\"trifft nicht zu\",C106,'9. Weighting'!M16)","v":{"v":1,"d":"1.0"}},{"$f":"VLOOKUP(D10,$C$102:$D$106,2,FALSE())","v":"medium"},{"$f":"'9. Weighting'!M16","v":1},null,{"$f":"IF(J10<>0,ROUND(SUM(I11:I12)/J10,1),\"-\")","v":{"v":0.1,"d":"10 %"}},{"$f":"IF(J10=0,0,H10*J10)","v":{"v":4.44444444444444,"d":"4"}},{"$f":"'9. Weighting'!M15","v":{"v":44.4444444444444,"d":"44"}},null,{"$f":"VLOOKUP(O10,$C$102:$E$106,3,FALSE())","v":1},{"$f":"VLOOKUP(D10,$C$102:$E$106,3,FALSE())","v":1},{"$f":"IF(L10=M10,\"\",'12.lan'!$D$240&VLOOKUP(L10,$C$102:$D$106,2,FALSE())&\" (\"&L10&\")\")","v":""},{"$f":"IF(K10=\"trifft nicht zu\",C106,'9. Weighting'!M16)","v":1}]
[null,"A1.1",{"$f":"'12.lan'!D110","v":"Working conditions and social impact in the supply chain"},null,null,{"$f":"'12.lan'!$D$329","v":"Introduce value between 0 and 10"},null,1,{"$f":"J11*H11/10","v":{"v":4.44444444444444,"d":"4"}},{"$f":"J10*K11/K11","v":{"v":44.4444444444444,"d":"44"}},1,null,null,{"$f":"IF(L11=M11,\"\",'12.lan'!$D$240&\" \"&VLOOKUP(L11,$C$102:$D$106,2,FALSE())&\" (\"&L11&\")\")","v":""}]
[null,"A1.2",{"$f":"'12.lan'!D111","v":"Negative aspect: violation of human dignity in the supply chain"},null,null,{"$f":"'12.lan'!$D$330","v":"Introduce negative points between 0 and -200"},null,0,{"$f":"H12*J10/50","v":0},{"$f":"-200*J10/50","v":{"v":-177.777777777778,"d":"-178"}}]
[null,"A2",{"$f":"'12.lan'!D112","v":"Solidarity and social justice in the supply chain"},{"$f":"IF(K13=\"trifft nicht zu\",C106,'9. Weighting'!N16)","v":{"v":1,"d":"1.0"}},{"$f":"VLOOKUP(D13,$C$102:$D$106,2,FALSE())","v":"medium"},{"$f":"IF(K13=\"trifft nicht zu\",\"trifft nicht zu\",'9. Weighting'!N16)","v":1},null,{"$f":"IF(J13<>0,ROUND(SUM(I14:I16)/J13,1),\"-\")","v":{"v":0.1,"d":"10 %"}},{"$f":"IF(J13=0,0,H13*J13)","v":{"v":4.44444444444444,"d":"4"}},{"$f":"'9. Weighting'!N15","v":{"v":44.4444444444444,"d":"44"}},{"$f":"IF(AND(D14=\"trifft nicht zu\",D15=\"trifft nicht zu\"),\"trifft nicht zu\",\"\")","v":""},{"$f":"VLOOKUP(O13,$C$102:$E$106,3,FALSE())","v":1},{"$f":"VLOOKUP(D13,$C$102:$E$106,3,FALSE())","v":1},{"$f":"IF(L13=M13,\"\",'12.lan'!$D$240&VLOOKUP(L13,$C$102:$D$106,2,FALSE())&\" (\"&L13&\")\")","v":""},{"$f":"IF(K13=\"trifft nicht zu\",C106,'9. Weighting'!N16)","v":1}]
[null,"A2.1",{"$f":"'12.lan'!D113","v":"Fair business practices towards direct suppliers"},{"v":1,"d":"1.0"},{"$f":"VLOOKUP(D14,$C$102:$D$106,2,FALSE())","v":"medium"},{"$f":"'12.lan'!$D$329","v":"Introduce value between 0 and 10"},null,2,{"$f":"IFERROR(J14*H14/10,0)","v":{"v":4.44444444444444,"d":"4"}},{"$f":"IFERROR(J13*K14/(K15+K14),0)","v":{"v":22.2222222222222,"d":"22"}},{"$f":"VLOOKUP(D14,$C$102:$E$106,3,FALSE())","v":1},{"$f":"VLOOKUP(O14,$C$102:$E$106,3,FALSE())","v":1},{"$f":"VLOOKUP(D14,$C$102:$E$106,3,FALSE())","v":1},{"$f":"IF(L14=M14,\"\",'12.lan'!$D$240&VLOOKUP(L14,$C$102:$D$106,2,FALSE())&\" (\"&L14&\")\")","v":""},{"$f":"C104","v":1}]
[null,"A2.2",{"$f":"'12.lan'!D114","v":"Exercising a positive influence on solidarity and social justice in the supply chain"},{"$f":"C104","v":{"v":1,"d":"1.0"}},{"$f":"VLOOKUP(D15,$C$102:$D$106,2,FALSE())","v":"medium"},{"$f":"'12.lan'!$D$329","v":"Introduce value between 0 and 10"},null,3,{"$f":"IFERROR(J15*H15/10,0)","v":{"v":6.66666666666667,"d":"7"}},{"$f":"IFERROR(J13*K15/(K14+K15),0)","v":{"v":22.2222222222222,"d":"22"}},{"$f":"VLOOKUP(D15,$C$102:$E$106,3,FALSE())","v":1},{"$f":"VLOOKUP(O15,$C$102:$E$106,3,FALSE())","v":1},{"$f":"VLOOKUP(D15,$C$102:$E$106,3,FALSE())","v":1},{"$f":"IF(L15=M15,\"\",'12.lan'!$D$240&VLOOKUP(L15,$C$102:$D$106,2,FALSE())&\" (\"&L15&\")\")","v":""},{"$f":"C104","v":1}]
[null,"A2.3",{"$f":"'12.lan'!D115","v":"Negative aspect: abuse of market power against suppliers"},null,null,{"$f":"'12.lan'!$D$330","v":"Introduce negative points between 0 and -200"},null,-10,{"$f":"H16*J13/50","v":{"v":-8.88888888888889,"d":"-9"}},{"$f":"-200*J13/50","v":{"v":-177.777777777778,"d":"-178"}}]
[null,"A3",{"$f":"'12.lan'!D116","v":"Environmental sustainability in the supply chain"},{"$f":"IF(K17=\"trifft nicht zu\",C106,'9. Weighting'!O16)","v":{"v":1,"d":"1.0"}},{"$f":"VLOOKUP(D17,$C$102:$D$106,2,FALSE())","v":"medium"},{"$f":"IF(K17=\"trifft nicht zu\",\"trifft nicht zu\",'9. Weighting'!O16)","v":1},null,{"$f":"IF(J17<>0,ROUND(SUM(I18:I19)/J17,1),\"-\")","v":{"v":0.1,"d":"10 %"}},{"$f":"IF(J17=0,0,H17*J17)","v":{"v":4.44444444444444,"d":"4"}},{"$f":"'9. Weighting'!O15","v":{"v":44.4444444444444,"d":"44"}},{"$f":"IF(D18=\"trifft nicht zu\",\"trifft nicht zu\",\"\")","v":""},{"$f":"VLOOKUP(O17,$C$102:$E$106,3,FALSE())","v":1},{"$f":"VLOOKUP(D17,$C$102:$E$106,3,FALSE())","v":1},{"$f":"IF(L17=M17,\"\",'12.lan'!$D$240&VLOOKUP(L17,$C$102:$D$106,2,FALSE())&\" (\"&L17&\")\")","v":""},{"$f":"IF(K17=\"trifft nicht zu\",C106,'9. Weighting'!O16)","v":1}]
[null,"A3.1",{"$f":"'12.lan'!D117","v":"Environmental impact throughout the supply chain"},null,null,{"$f":"'12.lan'!$D$329","v":"Introduce value between 0 and 10"},null,4,{"$f":"J18*H18/10","v":{"v":17.7777777777778,"d":"18"}},{"$f":"J17*K18/K18","v":{"v":44.4444444444444,"d":"44"}},1,null,null,{"$f":"IF(L18=M18,\"\",'12.lan'!$D$240&VLOOKUP(L18,$C$102:$D$106,2,FALSE())&\" (\"&L18&\")\")","v":""}]
[null,"A3.2",{"$f":"'12.lan'!D118","v":"Negative aspect: disproportionate environmental impact throughout the supply chain"},null,null,{"$f":"'12.lan'!$D$330","v":"Introduce negative points between 0 and -200"},null,-15,{"$f":"H19*J17/50","v":{"v":-13.3333333333333,"d":"-13"}},{"$f":"-200*J17/50","v":{"v":-177.777777777778,"d":"-178"}}]
[null,"A4",{"$f":"'12.lan'!D119","v":"Transparency & co-determination in the supply chain"},{"$f":"IF(K20=\"trifft nicht zu\",C106,'9. Weighting'!P16)","v":{"v":1,"d":"1.0"}},{"$f":"VLOOKUP(D20,$C$102:$D$106,2,FALSE())","v":"medium"},{"$f":"IF(K20=\"trifft nicht zu\",\"trifft nicht zu\",'9. Weighting'!P16)","v":1},null,{"$f":"IF(J20<>0,ROUND(SUM(I21:I22)/J20,1),\"-\")","v":{"v":0.6,"d":"60 %"}},{"$f":"IF(J20=0,0,H20*J20)","v":{"v":26.6666666666667,"d":"27"}},{"$f":"'9. Weighting'!P15","v":{"v":44.4444444444444,"d":"44"}},{"$f":"IF(AND(D21=\"trifft nicht zu\",D22=\"trifft nicht zu\"),\"trifft nicht zu\",\"\")","v":""},{"$f":"VLOOKUP(O20,$C$102:$E$106,3,FALSE())","v":1},{"$f":"VLOOKUP(D20,$C$102:$E$106,3,FALSE())","v":1},{"$f":"IF(L20=M20,\"\",'12.lan'!$D$240&VLOOKUP(L20,$C$102:$D$106,2,FALSE())&\" (\"&L20&\")\")","v":""},{"$f":"IF(K20=\"trifft nicht zu\",C106,'9. Weighting'!P16)","v":1}]
[null,"A4.1",{"$f":"'12.lan'!D120","v":"Transparency towards suppliers and their right to co-determination"},{"$f":"C104","v":{"v":1,"d":"1.0"}},{"$f":"VLOOKUP(D21,$C$102:$D$106,2,FALSE())","v":"medium"},{"$f":"'12.lan'!$D$329","v":"Introduce value between 0 and 10"},null,5,{"$f":"IFERROR(J21*H21/10,0)","v":{"v":11.1111111111111,"d":"11"}},{"$f":"IFERROR(J20*K21/(K22+K21),0)","v":{"v":22.2222222222222,"d":"22"}},{"$f":"VLOOKUP(D21,$C$102:$E$106,3,FALSE())","v":1},{"$f":"VLOOKUP(O21,$C$102:$E$106,3,FALSE())","v":1},{"$f":"VLOOKUP(D21,$C$102:$E$106,3,FALSE())","v":1},{"$f":"IF(L21=M21,\"\",'12.lan'!$D$240&VLOOKUP(L21,$C$102:$D$106,2,FALSE())&\" (\"&L21&\")\")","v":""},{"$f":"C104","v":1}]
[null,"A4.2",{"$f":"'12.lan'!D121","v":"Positive influence on transparency and co-determination throughout the supply chain"},{"$f":"C104","v":{"v":1,"d":"1.0"}},{"$f":"VLOOKUP(D22,$C$102:$D$106,2,FALSE())","v":"medium"},{"$f":"'12.lan'!$D$329","v":"Introduce value between 0 and 10"},null,6,{"$f":"IFERROR(J22*H22/10,0)","v":{"v":13.3333333333333,"d":"13"}},{"$f":"IFERROR(J20*K22/(K21+K22),0)","v":{"v":22.2222222222222,"d":"22"}},{"$f":"VLOOKUP(D22,$C$102:$E$106,3,FALSE())","v":1},{"$f":"VLOOKUP(O22,$C$102:$E$106,3,FALSE())","v":1},{"$f":"VLOOKUP(D22,$C$102:$E$106,3,FALSE())","v":1},{"$f":"IF(L22=M22,\"\",'12.lan'!$D$240&VLOOKUP(L22,$C$102:$D$106,2,FALSE())&\" (\"&L22&\")\")","v":""},{"$f":"C104","v":1}]
[null,"B",{"$f":"'12.lan'!D122","v":"Owners, equity- and financial service providers"},{"$f":"L23","v":0.5},{"$f":"VLOOKUP(D23,$C$102:$D$106,2,FALSE())","v":"low"},null,null,{"$f":"IFERROR(I23/J23,0)","v":{"v":0.37,"d":"37 %"}},{"$f":"I24+I28+I31+I35","v":{"v":41.1111111111111,"d":"41"}},{"$f":"J24+J28+J31+J35","v":{"v":111.111111111111,"d":"111"}},null,{"$f":"'9. Weighting'!K50","v":0.5},null,{"$f":"IF(D23<>L23,'12.lan'!$D$240&VLOOKUP(L23,$C$102:$D$106,2,FALSE())&\" (\"&L23&\")\",\"\")","v":""}]
[null,"B1",{"$f":"'12.lan'!D123","v":"Ethical position in relation to financial resources"},{"$f":"IF(K24=\"trifft nicht zu\",C106,'9. Weighting'!M24)","v":1.5},{"$f":"VLOOKUP(D24,$C$102:$D$106,2,FALSE())","v":"high"},{"$f":"IF(K24=\"trifft nicht zu\",\"trifft nicht zu\",'9. Weighting'!M24)","v":1.5},null,{"$f":"IF(J24<>0,ROUND(SUM(I25:I27)/J24,1),\"-\")","v":{"v":0.8,"d":"80 %"}},{"$f":"IF(J24=0,0,H24*J24)","v":{"v":26.6666666666667,"d":"27"}},{"$f":"'9. Weighting'!M23","v":{"v":33.3333333333333,"d":"33"}},{"$f":"IF(AND(D25=\"trifft nicht zu\",D26=\"trifft nicht zu\",,D27=\"trifft nicht zu\"),\"trifft nicht zu\",\"\")","v":""},{"$f":"VLOOKUP(O24,$C$102:$E$106,3,FALSE())","v":1.5},{"$f":"VLOOKUP(D24,$C$102:$E$106,3,FALSE())","v":1.5},{"$f":"IF(L24=M24,\"\",'12.lan'!$D$240&VLOOKUP(L24,$C$102:$D$106,2,FALSE())&\" (\"&L24&\")\")","v":""},{"$f":"IF(K24=\"trifft nicht zu\",C106,'9. Weighting'!M24)","v":1.5}]
[null,"B1.1",{"$f":"'12.lan'!D124","v":"Financial independence through equity financing"},{"$f":"C104","v":{"v":1,"d":"1.0"}},{"$f":"VLOOKUP(D25,$C$102:$D$106,2,FALSE())","v":"medium"},{"$f":"'12.lan'!$D$329","v":"Introduce value between 0 and 10"},null,7,{"$f":"IFERROR(J25*H25/10,0)","v":{"v":7.77777777777778,"d":"8"}},{"$f":"IFERROR($J$24*K25/($K$27+$K$26+$K$25),0)","v":{"v":11.1111111111111,"d":"11"}},{"$f":"VLOOKUP(D25,$C$102:$E$106,3,FALSE())","v":1},{"$f":"VLOOKUP(O25,$C$102:$E$106,3,FALSE())","v":1},{"$f":"VLOOKUP(D25,$C$102:$E$106,3,FALSE())","v":1},{"$f":"IF(L25=M25,\"\",'12.lan'!$D$240&VLOOKUP(L25,$C$102:$D$106,2,FALSE())&\" (\"&L25&\")\")","v":""},{"$f":"C104","v":1}]
[null,"B1.2",{"$f":"'12.lan'!D125","v":"Common Good-orientated borrowing"},{"$f":"C104","v":{"v":1,"d":"1.0"}},{"$f":"VLOOKUP(D26,$C$102:$D$106,2,FALSE())","v":"medium"},{"$f":"'12.lan'!$D$329","v":"Introduce value between 0 and 10"},null,8,{"$f":"IFERROR(J26*H26/10,0)","v":{"v":8.88888888888889,"d":"9"}},{"$f":"IFERROR($J$24*K26/($K$27+$K$26+$K$25),0)","v":{"v":11.1111111111111,"d":"11"}},{"$f":"VLOOKUP(D26,$C$102:$E$106,3,FALSE())","v":1},{"$f":"VLOOKUP(O26,$C$102:$E$106,3,FALSE())","v":1},{"$f":"VLOOKUP(D26,$C$102:$E$106,3,FALSE())","v":1},{"$f":"IF(L26=M26,\"\",'12.lan'!$D$240&VLOOKUP(L26,$C$102:$D$106,2,FALSE())&\" (\"&L26&\")\")","v":""},{"$f":"C104","v":1}]
[null,"B1.3",{"$f":"'12.lan'!D126","v":"Ethical position of external financial partners"},{"$f":"C104","v":{"v":1,"d":"1.0"}},{"$f":"VLOOKUP(D27,$C$102:$D$106,2,FALSE())","v":"medium"},{"$f":"'12.lan'!$D$329","v":"Introduce value between 0 and 10"},null,9,{"$f":"IFERROR(J27*H27/10,0)","v":10},{"$f":"IFERROR($J$24*K27/($K$27+$K$26+$K$25),0)","v":{"v":11.1111111111111,"d":"11"}},{"$f":"VLOOKUP(D27,$C$102:$E$106,3,FALSE())","v":1},{"$f":"VLOOKUP(O27,$C$102:$E$106,3,FALSE())","v":1},{"$f":"VLOOKUP(D27,$C$102:$E$106,3,FALSE())","v":1},{"$f":"IF(L27=M27,\"\",'12.lan'!$D$240&VLOOKUP(L27,$C$102:$D$106,2,FALSE())&\" (\"&L27&\")\")","v":""},{"$f":"C104","v":1}]
[null,"B2",{"$f":"'12.lan'!D127","v":"Social position in relation to financial resources"},{"$f":"IF(K28=\"trifft nicht zu\",C106,'9. Weighting'!N24)","v":{"v":1,"d":"1.0"}},{"$f":"VLOOKUP(D28,$C$102:$D$106,2,FALSE())","v":"medium"},{"$f":"IF(K28=\"trifft nicht zu\",\"trifft nicht zu\",'9. Weighting'!N24)","v":1},null,{"$f":"IF(J28<>0,ROUND(SUM(I29:I30)/J28,1),\"-\")","v":{"v":0.1,"d":"10 %"}},{"$f":"IF(J28=0,0,H28*J28)","v":{"v":2.22222222222222,"d":"2"}},{"$f":"'9. Weighting'!N23","v":{"v":22.2222222222222,"d":"22"}},null,{"$f":"VLOOKUP(O28,$C$102:$E$106,3,FALSE())","v":1},{"$f":"VLOOKUP(D28,$C$102:$E$106,3,FALSE())","v":1},{"$f":"IF(L28=M28,\"\",'12.lan'!$D$240&VLOOKUP(L28,$C$102:$D$106,2,FALSE())&\" (\"&L28&\")\")","v":""},{"$f":"IF(K28=\"trifft nicht zu\",C106,'9. Weighting'!N24)","v":1}]
[null,"B2.1",{"$f":"'12.lan'!D128","v":"Solidarity and Common Good-orientated use of funds"},null,null,{"$f":"'12.lan'!$D$329","v":"Introduce value between 0 and 10"},null,1,{"$f":"J29*H29/10","v":{"v":2.22222222222222,"d":"2"}},{"$f":"$J$28*K29/(K29)","v":{"v":22.2222222222222,"d":"22"}},1,{"$f":"VLOOKUP(O29,$C$102:$E$106,3,FALSE())","v":{"$error":"#N/A"}},{"$f":"VLOOKUP(D29,$C$102:$E$106,3,FALSE())","v":{"$error":"#N/A"}}]
[null,"B2.2",{"$f":"'12.lan'!D129","v":"Negative aspect: unfair distribution of funds"},null,null,{"$f":"'12.lan'!$D$330","v":"Introduce negative points between 0 and -200"},null,0,{"$f":"H30*J28/50","v":0},{"$f":"-200*J28/50","v":{"v":-88.8888888888889,"d":"-89"}}]
[null,"B3",{"$f":"'12.lan'!D130","v":"Use of funds in relation to social and environmental impacts"},{"$f":"IF(K31=\"trifft nicht zu\",C106,'9. Weighting'!O24)","v":1.5},{"$f":"VLOOKUP(D31,$C$102:$D$106,2,FALSE())","v":"high"},{"$f":"IF(K31=\"trifft nicht zu\",\"trifft nicht zu\",'9. Weighting'!O24)","v":1.5},null,{"$f":"IF(J31<>0,ROUND(SUM(I32:I34)/J31,1),\"-\")","v":{"v":0.3,"d":"30 %"}},{"$f":"IF(J31=0,0,H31*J31)","v":10},{"$f":"'9. Weighting'!O23","v":{"v":33.3333333333333,"d":"33"}},{"$f":"IF(AND(D32=\"trifft nicht zu\",D33=\"trifft nicht zu\"),\"trifft nicht zu\",\"\")","v":""},{"$f":"VLOOKUP(O31,$C$102:$E$106,3,FALSE())","v":1.5},{"$f":"VLOOKUP(D31,$C$102:$E$106,3,FALSE())","v":1.5},{"$f":"IF(L31=M31,\"\",'12.lan'!$D$240&VLOOKUP(L31,$C$102:$D$106,2,FALSE())&\" (\"&L31&\")\")","v":""},{"$f":"IF(K31=\"trifft nicht zu\",C106,'9. Weighting'!O24)","v":1.5}]
[null,"B3.1",{"$f":"'12.lan'!D131","v":"Environmental quality of investments"},{"$f":"C104","v":{"v":1,"d":"1.0"}},{"$f":"VLOOKUP(D32,$C$102:$D$106,2,FALSE())","v":"medium"},{"$f":"'12.lan'!$D$329","v":"Introduce value between 0 and 10"},null,2,{"$f":"IFERROR(J32*H32/10,0)","v":{"v":3.33333333333333,"d":"3"}},{"$f":"IFERROR($J$31*K32/($K$32+$K$33),0)","v":{"v":16.6666666666667,"d":"17"}},{"$f":"VLOOKUP(D32,$C$102:$E$106,3,FALSE())","v":1},{"$f":"VLOOKUP(O32,$C$102:$E$106,3,FALSE())","v":1},{"$f":"VLOOKUP(D32,$C$102:$E$106,3,FALSE())","v":1},{"$f":"IF(L32=M32,\"\",'12.lan'!$D$240&VLOOKUP(L32,$C$102:$D$106,2,FALSE())&\" (\"&L32&\")\")","v":""},{"$f":"C104","v":1}]
[null,"B3.2",{"$f":"'12.lan'!D132","v":"Common Good-orientated investment"},{"$f":"C104","v":{"v":1,"d":"1.0"}},{"$f":"VLOOKUP(D33,$C$102:$D$106,2,FALSE())","v":"medium"},{"$f":"'12.lan'!$D$329","v":"Introduce value between 0 and 10"},null,3,{"$f":"IFERROR(J33*H33/10,0)","v":5},{"$f":"IFERROR($J$31*K33/($K$32+$K$33),0)","v":{"v":16.6666666666667,"d":"17"}},{"$f":"VLOOKUP(D33,$C$102:$E$106,3,FALSE())","v":1},{"$f":"VLOOKUP(O33,$C$102:$E$106,3,FALSE())","v":1},{"$f":"VLOOKUP(D33,$C$102:$E$106,3,FALSE())","v":1},{"$f":"IF(L33=M33,\"\",'12.lan'!$D$240&VLOOKUP(L33,$C$102:$D$106,2,FALSE())&\" (\"&L33&\")\")","v":""},{"$f":"C104","v":1}]
[null,"B3.3",{"$f":"'12.lan'!D133","v":"Negative aspect: reliance on environmentally unsafe resources"},null,null,{"$f":"'12.lan'!$D$330","v":"Introduce negative points between 0 and -200"},null,0,{"$f":"H34*J31/50","v":0},{"$f":"-200*J31/50","v":{"v":-133.333333333333,"d":"-133"}}]
[null,"B4",{"$f":"'12.lan'!D134","v":"Ownership and co-determination"},{"$f":"IF(K35=\"trifft nicht zu\",C106,'9. Weighting'!P24)","v":{"v":1,"d":"1.0"}},{"$f":"VLOOKUP(D35,$C$102:$D$106,2,FALSE())","v":"medium"},{"$f":"IF(K35=\"trifft nicht zu\",\"trifft nicht zu\",'9. Weighting'!P24)","v":1},null,{"$f":"IF(J35<>0,ROUND(SUM(I36:I37)/J35,1),\"-\")","v":{"v":0.1,"d":"10 %"}},{"$f":"IF(J35=0,0,H35*J35)","v":{"v":2.22222222222222,"d":"2"}},{"$f":"'9. Weighting'!P23","v":{"v":22.2222222222222,"d":"22"}},null,{"$f":"VLOOKUP(O35,$C$102:$E$106,3,FALSE())","v":1},{"$f":"VLOOKUP(D35,$C$102:$E$106,3,FALSE())","v":1},{"$f":"IF(L35=M35,\"\",'12.lan'!$D$240&VLOOKUP(L35,$C$102:$D$106,2,FALSE())&\" (\"&L35&\")\")","v":""},{"$f":"IF(K35=\"trifft nicht zu\",C106,'9. Weighting'!P24)","v":1}]
[null,"B4.1",{"$f":"'12.lan'!D135","v":"Common Good-orientated ownership structure"},null,null,{"$f":"'12.lan'!$D$329","v":"Introduce value between 0 and 10"},null,1,{"$f":"J36*H36/10","v":{"v":2.22222222222222,"d":"2"}},{"$f":"$J$35*K36/(K36)","v":{"v":22.2222222222222,"d":"22"}},1]
[null,"B4.2",{"$f":"'12.lan'!D136","v":"Negative aspect: hostile takeover"},null,null,{"$f":"'12.lan'!$D$330","v":"Introduce negative points between 0 and -200"},null,0,{"$f":"H37*J35/50","v":0},{"$f":"-200*J35/50","v":{"v":-88.8888888888889,"d":"-89"}}]
[null,"C",{"$f":"'12.lan'!D137","v":"Employees"},{"$f":"L38","v":{"v":2,"d":"2.0"}},{"$f":"VLOOKUP(D38,$C$102:$D$106,2,FALSE())","v":"very high"},null,null,{"$f":"IFERROR(I38/J38,0)","v":{"v":0.2,"d":"20 %"}},{"$f":"I39+I44+I49+I54","v":{"v":71.1111111111111,"d":"71"}},{"$f":"J39+J44+J49+J54","v":{"v":355.555555555556,"d":"356"}},null,{"$f":"'9. Weighting'!K51","v":2},null,{"$f":"IF(D38<>L38,'12.lan'!$D$240&VLOOKUP(L38,$C$102:$D$106,2,FALSE())&\" (\"&L38&\")\",\"\")","v":""}]
[null,"C1",{"$f":"'12.lan'!D138","v":"Human dignity in the workplace and working environment"},{"v":1,"d":"1.0"},{"$f":"VLOOKUP(D39,$C$102:$D$106,2,FALSE())","v":"medium"},{"$f":"IF(K39=\"trifft nicht zu\",\"trifft nicht zu\",'9. Weighting'!M30)","v":1},null,{"$f":"IF(J39<>0,ROUND(SUM(I40:I43)/J39,1),\"-\")","v":{"v":0.2,"d":"20 %"}},{"$f":"IF(J39=0,0,H39*J39)","v":{"v":17.7777777777778,"d":"18"}},{"$f":"'9. Weighting'!M29","v":{"v":88.8888888888889,"d":"89"}},{"$f":"IF(AND(D40=\"trifft nicht zu\",D41=\"trifft nicht zu\",,D42=\"trifft nicht zu\"),\"trifft nicht zu\",\"\")","v":""},{"$f":"VLOOKUP(O39,$C$102:$E$106,3,FALSE())","v":1},{"$f":"VLOOKUP(D39,$C$102:$E$106,3,FALSE())","v":1},{"$f":"IF(L39=M39,\"\",'12.lan'!$D$240&VLOOKUP(L39,$C$102:$D$106,2,FALSE())&\" (\"&L39&\")\")","v":""},{"$f":"IF(K39=\"trifft nicht zu\",C106,'9. Weighting'!M30)","v":1}]
[null,"C1.1",{"$f":"'12.lan'!D139","v":"Employee-focused organisational culture"},{"$f":"C104","v":{"v":1,"d":"1.0"}},{"$f":"VLOOKUP(D40,$C$102:$D$106,2,FALSE())","v":"medium"},{"$f":"'12.lan'!$D$329","v":"Introduce value between 0 and 10"},null,1,{"$f":"IFERROR(J40*H40/10,0)","v":{"v":2.96296296296296,"d":"3"}},{"$f":"IFERROR($J$39*K40/(SUM($K$40:$K$42)),0)","v":{"v":29.6296296296296,"d":"30"}},{"$f":"VLOOKUP(D40,$C$102:$E$106,3,FALSE())","v":1},{"$f":"VLOOKUP(O40,$C$102:$E$106,3,FALSE())","v":1},{"$f":"VLOOKUP(D40,$C$102:$E$106,3,FALSE())","v":1},{"$f":"IF(L40=M40,\"\",'12.lan'!$D$240&VLOOKUP(L40,$C$102:$D$106,2,FALSE())&\" (\"&L40&\")\")","v":""},{"$f":"C104","v":1}]
[null,"C1.2",{"$f":"'12.lan'!D140","v":"Health promotion and occupational health and safety"},{"$f":"C104","v":{"v":1,"d":"1.0"}},{"$f":"VLOOKUP(D41,$C$102:$D$106,2,FALSE())","v":"medium"},{"$f":"'12.lan'!$D$329","v":"Introduce value between 0 and 10"},null,2,{"$f":"IFERROR(J41*H41/10,0)","v":{"v":5.92592592592593,"d":"6"}},{"$f":"IFERROR($J$39*K41/(SUM($K$40:$K$42)),0)","v":{"v":29.6296296296296,"d":"30"}},{"$f":"VLOOKUP(D41,$C$102:$E$106,3,FALSE())","v":1},{"$f":"VLOOKUP(O41,$C$102:$E$106,3,FALSE())","v":1},{"$f":"VLOOKUP(D41,$C$102:$E$106,3,FALSE())","v":1},{"$f":"IF(L41=M41,\"\",'12.lan'!$D$240&VLOOKUP(L41,$C$102:$D$106,2,FALSE())&\" (\"&L41&\")\")","v":""},{"$f":"C104","v":1}]
[null,"C1.3",{"$f":"'12.lan'!D141","v":"Diversity and equal opportunities"},{"$f":"C104","v":{"v":1,"d":"1.0"}},{"$f":"VLOOKUP(D42,$C$102:$D$106,2,FALSE())","v":"medium"},{"$f":"'12.lan'!$D$329","v":"Introduce value between 0 and 10"},null,3,{"$f":"IFERROR(J42*H42/10,0)","v":{"v":8.88888888888889,"d":"9"}},{"$f":"IFERROR($J$39*K42/(SUM($K$40:$K$42)),0)","v":{"v":29.6296296296296,"d":"30"}},{"$f":"VLOOKUP(D42,$C$102:$E$106,3,FALSE())","v":1},{"$f":"VLOOKUP(O42,$C$102:$E$106,3,FALSE())","v":1},{"$f":"VLOOKUP(D42,$C$102:$E$106,3,FALSE())","v":1},{"$f":"IF(L42=M42,\"\",'12.lan'!$D$240&VLOOKUP(L42,$C$102:$D$106,2,FALSE())&\" (\"&L42&\")\")","v":""},{"$f":"C104","v":1}]
[null,"C1.4",{"$f":"'12.lan'!D142","v":"Negative aspect: unfit working conditions"},null,null,{"$f":"'12.lan'!$D$330","v":"Introduce negative points between 0 and -200"},null,0,{"$f":"H43*J39/50","v":0},{"$f":"-200*J39/50","v":{"v":-355.555555555556,"d":"-356"}}]
[null,"C2",{"$f":"'12.lan'!D143","v":"Self-determined working arrangements"},{"$f":"IF(K44=\"trifft nicht zu\",C106,'9. Weighting'!N30)","v":{"v":1,"d":"1.0"}},{"$f":"VLOOKUP(D44,$C$102:$D$106,2,FALSE())","v":"medium"},{"$f":"IF(K44=\"trifft nicht zu\",\"trifft nicht zu\",'9. Weighting'!N30)","v":1},null,{"$f":"IF(J44<>0,ROUND(SUM(I45:I48)/J44,1),\"-\")","v":{"v":0.2,"d":"20 %"}},{"$f":"IF(J44=0,0,H44*J44)","v":{"v":17.7777777777778,"d":"18"}},{"$f":"'9. Weighting'!N29","v":{"v":88.8888888888889,"d":"89"}},{"$f":"IF(AND(D45=\"trifft nicht zu\",D46=\"trifft nicht zu\",,D47=\"trifft nicht zu\"),\"trifft nicht zu\",\"\")","v":""},{"$f":"VLOOKUP(O44,$C$102:$E$106,3,FALSE())","v":1},{"$f":"VLOOKUP(D44,$C$102:$E$106,3,FALSE())","v":1},{"$f":"IF(L44=M44,\"\",'12.lan'!$D$240&VLOOKUP(L44,$C$102:$D$106,2,FALSE())&\" (\"&L44&\")\")","v":""},{"$f":"IF(K44=\"trifft nicht zu\",C106,'9. Weighting'!N30)","v":1}]
[null,"C2.1",{"$f":"'12.lan'!D144","v":"Pay structure"},{"$f":"C104","v":{"v":1,"d":"1.0"}},{"$f":"VLOOKUP(D45,$C$102:$D$106,2,FALSE())","v":"medium"},{"$f":"'12.lan'!$D$329","v":"Introduce value between 0 and 10"},null,1,{"$f":"IFERROR(J45*H45/10,0)","v":{"v":2.96296296296296,"d":"3"}},{"$f":"IFERROR($J$44*K45/(SUM($K$45:$K$47)),0)","v":{"v":29.6296296296296,"d":"30"}},{"$f":"VLOOKUP(D45,$C$102:$E$106,3,FALSE())","v":1},{"$f":"VLOOKUP(O45,$C$102:$E$106,3,FALSE())","v":1},{"$f":"VLOOKUP(D45,$C$102:$E$106,3,FALSE())","v":1},{"$f":"IF(L45=M45,\"\",'12.lan'!$D$240&VLOOKUP(L45,$C$102:$D$106,2,FALSE())&\" (\"&L45&\")\")","v":""},{"$f":"C104","v":1}]
[null,"C2.2",{"$f":"'12.lan'!D145","v":"Structuring working time"},{"$f":"C104","v":{"v":1,"d":"1.0"}},{"$f":"VLOOKUP(D46,$C$102:$D$106,2,FALSE())","v":"medium"},{"$f":"'12.lan'!$D$329","v":"Introduce value between 0 and 10"},null,2,{"$f":"IFERROR(J46*H46/10,0)","v":{"v":5.92592592592593,"d":"6"}},{"$f":"IFERROR($J$44*K46/(SUM($K$45:$K$47)),0)","v":{"v":29.6296296296296,"d":"30"}},{"$f":"VLOOKUP(D46,$C$102:$E$106,3,FALSE())","v":1},{"$f":"VLOOKUP(O46,$C$102:$E$106,3,FALSE())","v":1},{"$f":"VLOOKUP(D46,$C$102:$E$106,3,FALSE())","v":1},{"$f":"IF(L46=M46,\"\",'12.lan'!$D$240&VLOOKUP(L46,$C$102:$D$106,2,FALSE())&\" (\"&L46&\")\")","v":""},{"$f":"C104","v":1}]
[null,"C2.3",{"$f":"'12.lan'!D146","v":"Employment structure and work-life balance"},{"$f":"C104","v":{"v":1,"d":"1.0"}},{"$f":"VLOOKUP(D47,$C$102:$D$106,2,FALSE())","v":"medium"},{"$f":"'12.lan'!$D$329","v":"Introduce value between 0 and 10"},null,3,{"$f":"IFERROR(J47*H47/10,0)","v":{"v":8.88888888888889,"d":"9"}},{"$f":"IFERROR($J$44*K47/(SUM($K$45:$K$47)),0)","v":{"v":29.6296296296296,"d":"30"}},{"$f":"VLOOKUP(D47,$C$102:$E$106,3,FALSE())","v":1},{"$f":"VLOOKUP(O47,$C$102:$E$106,3,FALSE())","v":1},{"$f":"VLOOKUP(D47,$C$102:$E$106,3,FALSE())","v":1},{"$f":"IF(L47=M47,\"\",'12.lan'!$D$240&VLOOKUP(L47,$C$102:$D$106,2,FALSE())&\" (\"&L47&\")\")","v":""},{"$f":"C104","v":1}]
[null,"C2.4",{"$f":"'12.lan'!D147","v":"Negative aspect: unfair employment contracts"},null,null,{"$f":"'12.lan'!$D$330","v":"Introduce negative points between 0 and -200"},null,0,{"$f":"H48*J44/50","v":0},{"$f":"-200*J44/50","v":{"v":-355.555555555556,"d":"-356"}}]
[null,"C3",{"$f":"'12.lan'!D148","v":"Environmentally-friendly behaviour of staff"},{"v":1,"d":"1.0"},{"$f":"VLOOKUP(D49,$C$102:$D$106,2,FALSE())","v":"medium"},{"$f":"IF(K49=\"trifft nicht zu\",\"trifft nicht zu\",'9. Weighting'!O30)","v":1},null,{"$f":"IF(J49<>0,ROUND(SUM(I50:I53)/J49,1),\"-\")","v":{"v":0.2,"d":"20 %"}},{"$f":"IF(J49=0,0,H49*J49)","v":{"v":17.7777777777778,"d":"18"}},{"$f":"'9. Weighting'!O29","v":{"v":88.8888888888889,"d":"89"}},{"$f":"IF(AND(D50=\"trifft nicht zu\",D51=\"trifft nicht zu\",,D52=\"trifft nicht zu\"),\"trifft nicht zu\",\"\")","v":""},{"$f":"VLOOKUP(O49,$C$102:$E$106,3,FALSE())","v":1},{"$f":"VLOOKUP(D49,$C$102:$E$106,3,FALSE())","v":1},{"$f":"IF(L49=M49,\"\",'12.lan'!$D$240&VLOOKUP(L49,$C$102:$D$106,2,FALSE())&\" (\"&L49&\")\")","v":""},{"$f":"IF(K49=\"trifft nicht zu\",C106,'9. Weighting'!O30)","v":1}]
[null,"C3.1",{"$f":"'12.lan'!D149","v":"Food during working hours"},{"$f":"C104","v":{"v":1,"d":"1.0"}},{"$f":"VLOOKUP(D50,$C$102:$D$106,2,FALSE())","v":"medium"},{"$f":"'12.lan'!$D$329","v":"Introduce value between 0 and 10"},null,1,{"$f":"IFERROR(J50*H50/10,0)","v":{"v":2.96296296296296,"d":"3"}},{"$f":"IFERROR($J$49*K50/(SUM($K$50:$K$52)),0)","v":{"v":29.6296296296296,"d":"30"}},{"$f":"VLOOKUP(D50,$C$102:$E$106,3,FALSE())","v":1},{"$f":"VLOOKUP(O50,$C$102:$E$106,3,FALSE())","v":1},{"$f":"VLOOKUP(D50,$C$102:$E$106,3,FALSE())","v":1},{"$f":"IF(L50=M50,\"\",'12.lan'!$D$240&VLOOKUP(L50,$C$102:$D$106,2,FALSE())&\" (\"&L50&\")\")","v":""},{"$f":"C104","v":1}]
[null,"C3.2",{"$f":"'12.lan'!D150","v":"Travel to work"},{"$f":"C104","v":{"v":1,"d":"1.0"}},{"$f":"VLOOKUP(D51,$C$102:$D$106,2,FALSE())","v":"medium"},{"$f":"'12.lan'!$D$329","v":"Introduce value between 0 and 10"},null,2,{"$f":"IFERROR(J51*H51/10,0)","v":{"v":5.92592592592593,"d":"6"}},{"$f":"IFERROR($J$49*K51/(SUM($K$50:$K$52)),0)","v":{"v":29.6296296296296,"d":"30"}},{"$f":"VLOOKUP(D51,$C$102:$E$106,3,FALSE())","v":1},{"$f":"VLOOKUP(O51,$C$102:$E$106,3,FALSE())","v":1},{"$f":"VLOOKUP(D51,$C$102:$E$106,3,FALSE())","v":1},{"$f":"IF(L51=M51,\"\",'12.lan'!$D$240&VLOOKUP(L51,$C$102:$D$106,2,FALSE())&\" (\"&L51&\")\")","v":""},{"$f":"C104","v":1}]
[null,"C3.3",{"$f":"'12.lan'!D151","v":"Organisational culture, cultivating awareness for an environmentally-friendly approach"},{"$f":"C104","v":{"v":1,"d":"1.0"}},{"$f":"VLOOKUP(D52,$C$102:$D$106,2,FALSE())","v":"medium"},{"$f":"'12.lan'!$D$329","v":"Introduce value between 0 and 10"},null,3,{"$f":"IFERROR(J52*H52/10,0)","v":{"v":8.88888888888889,"d":"9"}},{"$f":"IFERROR($J$49*K52/(SUM($K$50:$K$52)),0)","v":{"v":29.6296296296296,"d":"30"}},{"$f":"VLOOKUP(D52,$C$102:$E$106,3,FALSE())","v":1},{"$f":"VLOOKUP(O52,$C$102:$E$106,3,FALSE())","v":1},{"$f":"VLOOKUP(D52,$C$102:$E$106,3,FALSE())","v":1},{"$f":"IF(L52=M52,\"\",'12.lan'!$D$240&VLOOKUP(L52,$C$102:$D$106,2,FALSE())&\" (\"&L52&\")\")","v":""},{"$f":"C104","v":1}]
[null,"C3.4",{"$f":"'12.lan'!D152","v":"Negative aspect: guidance on waste/ environmentally damaging practices"},null,null,{"$f":"'12.lan'!$D$330","v":"Introduce negative points between 0 and -200"},null,0,{"$f":"H53*J49/50","v":0},{"$f":"-200*J49/50","v":{"v":-355.555555555556,"d":"-356"}}]
[null,"C4",{"$f":"'12.lan'!D153","v":"Co-determination and transparency within the organisation"},{"$f":"IF(K54=\"trifft nicht zu\",C106,'9. Weighting'!P30)","v":{"v":1,"d":"1.0"}},{"$f":"VLOOKUP(D54,$C$102:$D$106,2,FALSE())","v":"medium"},{"$f":"IF(K54=\"trifft nicht zu\",\"trifft nicht zu\",'9. Weighting'!P30)","v":1},null,{"$f":"IF(J54<>0,ROUND(SUM(I55:I58)/J54,1),\"-\")","v":{"v":0.2,"d":"20 %"}},{"$f":"IF(J54=0,0,H54*J54)","v":{"v":17.7777777777778,"d":"18"}},{"$f":"'9. Weighting'!P29","v":{"v":88.8888888888889,"d":"89"}},{"$f":"IF(AND(D55=\"trifft nicht zu\",D56=\"trifft nicht zu\",,D57=\"trifft nicht zu\"),\"trifft nicht zu\",\"\")","v":""},{"$f":"VLOOKUP(O54,$C$102:$E$106,3,FALSE())","v":1},{"$f":"VLOOKUP(D54,$C$102:$E$106,3,FALSE())","v":1},{"$f":"IF(L54=M54,\"\",'12.lan'!$D$240&VLOOKUP(L54,$C$102:$D$106,2,FALSE())&\" (\"&L54&\")\")","v":""},{"$f":"IF(K54=\"trifft nicht zu\",C106,'9. Weighting'!P30)","v":1}]
[null,"C4.1",{"$f":"'12.lan'!D154","v":"Transparency within the organisation"},{"$f":"C104","v":{"v":1,"d":"1.0"}},{"$f":"VLOOKUP(D55,$C$102:$D$106,2,FALSE())","v":"medium"},{"$f":"'12.lan'!$D$329","v":"Introduce value between 0 and 10"},null,1,{"$f":"IFERROR(J55*H55/10,0)","v":{"v":2.96296296296296,"d":"3"}},{"$f":"IFERROR($J$54*K55/(SUM($K$55:$K$57)),0)","v":{"v":29.6296296296296,"d":"30"}},{"$f":"VLOOKUP(D55,$C$102:$E$106,3,FALSE())","v":1},{"$f":"VLOOKUP(O55,$C$102:$E$106,3,FALSE())","v":1},{"$f":"VLOOKUP(D55,$C$102:$E$106,3,FALSE())","v":1},{"$f":"IF(L55=M55,\"\",'12.lan'!$D$240&VLOOKUP(L55,$C$102:$D$106,2,FALSE())&\" (\"&L55&\")\")","v":""},{"$f":"C104","v":1}]
[null,"C4.2",{"$f":"'12.lan'!D155","v":"Legitimation of the management"},{"$f":"C104","v":{"v":1,"d":"1.0"}},{"$f":"VLOOKUP(D56,$C$102:$D$106,2,FALSE())","v":"medium"},{"$f":"'12.lan'!$D$329","v":"Introduce value between 0 and 10"},null,2,{"$f":"IFERROR(J56*H56/10,0)","v":{"v":5.92592592592593,"d":"6"}},{"$f":"IFERROR($J$54*K56/(SUM($K$55:$K$57)),0)","v":{"v":29.6296296296296,"d":"30"}},{"$f":"VLOOKUP(D56,$C$102:$E$106,3,FALSE())","v":1},{"$f":"VLOOKUP(O56,$C$102:$E$106,3,FALSE())","v":1},{"$f":"VLOOKUP(D56,$C$102:$E$106,3,FALSE())","v":1},{"$f":"IF(L56=M56,\"\",'12.lan'!$D$240&VLOOKUP(L56,$C$102:$D$106,2,FALSE())&\" (\"&L56&\")\")","v":""},{"$f":"C104","v":1}]
[null,"C4.3",{"$f":"'12.lan'!D156","v":"Employee co-determination"},{"$f":"C104","v":{"v":1,"d":"1.0"}},{"$f":"VLOOKUP(D57,$C$102:$D$106,2,FALSE())","v":"medium"},{"$f":"'12.lan'!$D$329","v":"Introduce value between 0 and 10"},null,3,{"$f":"IFERROR(J57*H57/10,0)","v":{"v":8.88888888888889,"d":"9"}},{"$f":"IFERROR($J$54*K57/(SUM($K$55:$K$57)),0)","v":{"v":29.6296296296296,"d":"30"}},{"$f":"VLOOKUP(D57,$C$102:$E$106,3,FALSE())","v":1},{"$f":"VLOOKUP(O57,$C$102:$E$106,3,FALSE())","v":1},{"$f":"VLOOKUP(D57,$C$102:$E$106,3,FALSE())","v":1},{"$f":"IF(L57=M57,\"\",'12.lan'!$D$240&VLOOKUP(L57,$C$102:$D$106,2,FALSE())&\" (\"&L57&\")\")","v":""},{"$f":"C104","v":1}]
[null,"C4.4",{"$f":"'12.lan'!D157","v":"Negative aspect: obstruction of works councils"},null,null,{"$f":"'12.lan'!$D$330","v":"Introduce negative points between 0 and -200"},null,0,{"$f":"H58*J54/50","v":0},{"$f":"-200*J54/50","v":{"v":-355.555555555556,"d":"-356"}}]
[null,"D",{"$f":"'12.lan'!D158","v":"Customers and other companies"},{"$f":"L59","v":{"v":1,"d":"1.0"}},{"$f":"VLOOKUP(D59,$C$102:$D$106,2,FALSE())","v":"medium"},null,null,{"$f":"IFERROR(I59/J59,0)","v":{"v":0.1,"d":"10 %"}},{"$f":"I60+I64+I68+I72","v":{"v":17.7777777777778,"d":"18"}},{"$f":"J60+J64+J68+J72","v":{"v":177.777777777778,"d":"178"}},null,{"$f":"'9. Weighting'!K52","v":1},null,{"$f":"IF(D59<>L59,'12.lan'!$D$240&VLOOKUP(L59,$C$102:$D$106,2,FALSE())&\" (\"&L59&\")\",\"\")","v":""}]
[null,"D1",{"$f":"'12.lan'!D159","v":"Ethical customer relations"},{"$f":"IF(K60=\"trifft nicht zu\",C106,'9. Weighting'!M37)","v":{"v":1,"d":"1.0"}},{"$f":"VLOOKUP(D60,$C$102:$D$106,2,FALSE())","v":"medium"},{"$f":"IF(K60=\"trifft nicht zu\",\"trifft nicht zu\",'9. Weighting'!M37)","v":1},null,{"$f":"IF(J60<>0,ROUND(SUM(I61:I63)/J60,1),\"-\")","v":{"v":0,"d":"0 %"}},{"$f":"IF(J60=0,0,H60*J60)","v":0},{"$f":"'9. Weighting'!M36","v":{"v":44.4444444444444,"d":"44"}},{"$f":"IF(AND(D61=\"trifft nicht zu\",D62=\"trifft nicht zu\"),\"trifft nicht zu\",\"\")","v":""},{"$f":"VLOOKUP(O60,$C$102:$E$106,3,FALSE())","v":1},{"$f":"VLOOKUP(D60,$C$102:$E$106,3,FALSE())","v":1},{"$f":"IF(L60=M60,\"\",'12.lan'!$D$240&VLOOKUP(L60,$C$102:$D$106,2,FALSE())&\" (\"&L60&\")\")","v":""},{"$f":"IF(K60=\"trifft nicht zu\",C106,'9. Weighting'!M37)","v":1}]
[null,"D1.1",{"$f":"'12.lan'!D160","v":"Respect for human dignity in communication with customers"},{"$f":"C104","v":{"v":1,"d":"1.0"}},{"$f":"VLOOKUP(D61,$C$102:$D$106,2,FALSE())","v":"medium"},{"$f":"'12.lan'!$D$329","v":"Introduce value between 0 and 10"},null,0,{"$f":"IFERROR(J61*H61/10,0)","v":0},{"$f":"IFERROR($J$60*K61/(SUM($K$61:$K$62)),0)","v":{"v":22.2222222222222,"d":"22"}},{"$f":"VLOOKUP(D61,$C$102:$E$106,3,FALSE())","v":1},{"$f":"VLOOKUP(O61,$C$102:$E$106,3,FALSE())","v":1},{"$f":"VLOOKUP(D61,$C$102:$E$106,3,FALSE())","v":1},{"$f":"IF(L61=M61,\"\",'12.lan'!$D$240&VLOOKUP(L61,$C$102:$D$106,2,FALSE())&\" (\"&L61&\")\")","v":""},{"$f":"C104","v":1}]
[null,"D1.2",{"$f":"'12.lan'!D161","v":"Barrier-free access"},{"$f":"C104","v":{"v":1,"d":"1.0"}},{"$f":"VLOOKUP(D62,$C$102:$D$106,2,FALSE())","v":"medium"},{"$f":"'12.lan'!$D$329","v":"Introduce value between 0 and 10"},null,0,{"$f":"IFERROR(J62*H62/10,0)","v":0},{"$f":"IFERROR($J$60*K62/(SUM($K$61:$K$62)),0)","v":{"v":22.2222222222222,"d":"22"}},{"$f":"VLOOKUP(D62,$C$102:$E$106,3,FALSE())","v":1},{"$f":"VLOOKUP(O62,$C$102:$E$106,3,FALSE())","v":1},{"$f":"VLOOKUP(D62,$C$102:$E$106,3,FALSE())","v":1},{"$f":"IF(L62=M62,\"\",'12.lan'!$D$240&VLOOKUP(L62,$C$102:$D$106,2,FALSE())&\" (\"&L62&\")\")","v":""},{"$f":"C104","v":1}]
[null,"D1.3",{"$f":"'12.lan'!D162","v":"Negative aspect: unethical advertising"},null,null,{"$f":"'12.lan'!$D$330","v":"Introduce negative points between 0 and -200"},null,0,{"$f":"H63*J60/50","v":0},{"$f":"-200*J60/50","v":{"v":-177.777777777778,"d":"-178"}}]
[null,"D2",{"$f":"'12.lan'!D163","v":"Cooperation and solidarity with other companies"},{"$f":"IF(K64=\"trifft nicht zu\",C106,'9. Weighting'!N37)","v":{"v":1,"d":"1.0"}},{"$f":"VLOOKUP(D64,$C$102:$D$106,2,FALSE())","v":"medium"},{"$f":"IF(K64=\"trifft nicht zu\",\"trifft nicht zu\",'9. Weighting'!N37)","v":1},null,{"$f":"IF(J64<>0,ROUND(SUM(I65:I67)/J64,1),\"-\")","v":{"v":0.4,"d":"40 %"}},{"$f":"IF(J64=0,0,H64*J64)","v":{"v":17.7777777777778,"d":"18"}},{"$f":"'9. Weighting'!N36","v":{"v":44.4444444444444,"d":"44"}},{"$f":"IF(AND(D65=\"trifft nicht zu\",D66=\"trifft nicht zu\"),\"trifft nicht zu\",\"\")","v":""},{"$f":"VLOOKUP(O64,$C$102:$E$106,3,FALSE())","v":1},{"$f":"VLOOKUP(D64,$C$102:$E$106,3,FALSE())","v":1},{"$f":"IF(L64=M64,\"\",'12.lan'!$D$240&VLOOKUP(L64,$C$102:$D$106,2,FALSE())&\" (\"&L64&\")\")","v":""},{"$f":"IF(K64=\"trifft nicht zu\",C106,'9. Weighting'!N37)","v":1}]
[null,"D2.1",{"$f":"'12.lan'!D164","v":"Cooperation with other companies"},{"$f":"C104","v":{"v":1,"d":"1.0"}},{"$f":"VLOOKUP(D65,$C$102:$D$106,2,FALSE())","v":"medium"},{"$f":"'12.lan'!$D$329","v":"Introduce value between 0 and 10"},null,2,{"$f":"IFERROR(J65*H65/10,0)","v":{"v":4.44444444444444,"d":"4"}},{"$f":"IFERROR($J$64*K65/(SUM($K$65:$K$66)),0)","v":{"v":22.2222222222222,"d":"22"}},{"$f":"VLOOKUP(D65,$C$102:$E$106,3,FALSE())","v":1},{"$f":"VLOOKUP(O65,$C$102:$E$106,3,FALSE())","v":1},{"$f":"VLOOKUP(D65,$C$102:$E$106,3,FALSE())","v":1},{"$f":"IF(L65=M65,\"\",'12.lan'!$D$240&VLOOKUP(L65,$C$102:$D$106,2,FALSE())&\" (\"&L65&\")\")","v":""},{"$f":"C104","v":1}]
[null,"D2.2",{"$f":"'12.lan'!D165","v":"Solidarity with other companies"},{"$f":"C104","v":{"v":1,"d":"1.0"}},{"$f":"VLOOKUP(D66,$C$102:$D$106,2,FALSE())","v":"medium"},{"$f":"'12.lan'!$D$329","v":"Introduce value between 0 and 10"},null,6,{"$f":"IFERROR(J66*H66/10,0)","v":{"v":13.3333333333333,"d":"13"}},{"$f":"IFERROR($J$64*K66/(SUM($K$65:$K$66)),0)","v":{"v":22.2222222222222,"d":"22"}},{"$f":"VLOOKUP(D66,$C$102:$E$106,3,FALSE())","v":1},{"$f":"VLOOKUP(O66,$C$102:$E$106,3,FALSE())","v":1},{"$f":"VLOOKUP(D66,$C$102:$E$106,3,FALSE())","v":1},{"$f":"IF(L66=M66,\"\",'12.lan'!$D$240&VLOOKUP(L66,$C$102:$D$106,2,FALSE())&\" (\"&L66&\")\")","v":""},{"$f":"C104","v":1}]
[null,"D2.3",{"$f":"'12.lan'!D166","v":"Negative aspect: abuse of market power to the detriment of other companies"},null,null,{"$f":"'12.lan'!$D$330","v":"Introduce negative points between 0 and -200"},null,0,{"$f":"H67*J64/50","v":0},{"$f":"-200*J64/50","v":{"v":-177.777777777778,"d":"-178"}}]
[null,"D3",{"$f":"'12.lan'!D167","v":"Impact on the environment of the use and disposal of products and services"},{"$f":"IF(K68=\"trifft nicht zu\",C106,'9. Weighting'!O37)","v":{"v":1,"d":"1.0"}},{"$f":"VLOOKUP(D68,$C$102:$D$106,2,FALSE())","v":"medium"},{"$f":"IF(K68=\"trifft nicht zu\",\"trifft nicht zu\",'9. Weighting'!O37)","v":1},null,{"$f":"IF(J68<>0,ROUND(SUM(I69:I71)/J68,1),\"-\")","v":{"v":0,"d":"0 %"}},{"$f":"IF(J68=0,0,H68*J68)","v":0},{"$f":"'9. Weighting'!O36","v":{"v":44.4444444444444,"d":"44"}},{"$f":"IF(AND(D69=\"trifft nicht zu\",D70=\"trifft nicht zu\"),\"trifft nicht zu\",\"\")","v":""},{"$f":"VLOOKUP(O68,$C$102:$E$106,3,FALSE())","v":1},{"$f":"VLOOKUP(D68,$C$102:$E$106,3,FALSE())","v":1},{"$f":"IF(L68=M68,\"\",'12.lan'!$D$240&VLOOKUP(L68,$C$102:$D$106,2,FALSE())&\" (\"&L68&\")\")","v":""},{"$f":"IF(K68=\"trifft nicht zu\",C106,'9. Weighting'!O37)","v":1}]
[null,"D3.1",{"$f":"'12.lan'!D168","v":"Environmental cost-benefit ration of products and services (efficiency and consistency)"},{"$f":"C104","v":{"v":1,"d":"1.0"}},{"$f":"VLOOKUP(D69,$C$102:$D$106,2,FALSE())","v":"medium"},{"$f":"'12.lan'!$D$329","v":"Introduce value between 0 and 10"},null,0,{"$f":"IFERROR(J69*H69/10,0)","v":0},{"$f":"IFERROR($J$68*K69/(SUM($K$69:$K$70)),0)","v":{"v":22.2222222222222,"d":"22"}},{"$f":"VLOOKUP(D69,$C$102:$E$106,3,FALSE())","v":1},{"$f":"VLOOKUP(O69,$C$102:$E$106,3,FALSE())","v":1},{"$f":"VLOOKUP(D69,$C$102:$E$106,3,FALSE())","v":1},{"$f":"IF(L69=M69,\"\",'12.lan'!$D$240&VLOOKUP(L69,$C$102:$D$106,2,FALSE())&\" (\"&L69&\")\")","v":""},{"$f":"C104","v":1}]
[null,"D3.2",{"$f":"'12.lan'!D169","v":"Moderate use of products and services (sufficiency)"},{"$f":"C104","v":{"v":1,"d":"1.0"}},{"$f":"VLOOKUP(D70,$C$102:$D$106,2,FALSE())","v":"medium"},{"$f":"'12.lan'!$D$329","v":"Introduce value between 0 and 10"},null,0,{"$f":"IFERROR(J70*H70/10,0)","v":0},{"$f":"IFERROR($J$68*K70/(SUM($K$69:$K$70)),0)","v":{"v":22.2222222222222,"d":"22"}},{"$f":"VLOOKUP(D70,$C$102:$E$106,3,FALSE())","v":1},{"$f":"VLOOKUP(O70,$C$102:$E$106,3,FALSE())","v":1},{"$f":"VLOOKUP(D70,$C$102:$E$106,3,FALSE())","v":1},{"$f":"IF(L70=M70,\"\",'12.lan'!$D$240&VLOOKUP(L70,$C$102:$D$106,2,FALSE())&\" (\"&L70&\")\")","v":""},{"$f":"C104","v":1}]
[null,"D3.3",{"$f":"'12.lan'!D170","v":"Negative aspect: wilful disregard of disproportionate environmental impacts"},null,null,{"$f":"'12.lan'!$D$330","v":"Introduce negative points between 0 and -200"},null,0,{"$f":"H71*J68/50","v":0},{"$f":"-200*J68/50","v":{"v":-177.777777777778,"d":"-178"}}]
[null,"D4",{"$f":"'12.lan'!D171","v":"Customer participation and product transparency"},{"$f":"IF(K72=\"trifft nicht zu\",C106,'9. Weighting'!P37)","v":{"v":1,"d":"1.0"}},{"$f":"VLOOKUP(D72,$C$102:$D$106,2,FALSE())","v":"medium"},{"$f":"IF(K72=\"trifft nicht zu\",\"trifft nicht zu\",'9. Weighting'!P37)","v":1},null,{"$f":"IF(J72<>0,ROUND(SUM(I73:I75)/J72,1),\"-\")","v":{"v":0,"d":"0 %"}},{"$f":"IF(J72=0,0,H72*J72)","v":0},{"$f":"'9. Weighting'!P36","v":{"v":44.4444444444444,"d":"44"}},{"$f":"IF(AND(D73=\"trifft nicht zu\",D74=\"trifft nicht zu\"),\"trifft nicht zu\",\"\")","v":""},{"$f":"VLOOKUP(O72,$C$102:$E$106,3,FALSE())","v":1},{"$f":"VLOOKUP(D72,$C$102:$E$106,3,FALSE())","v":1},{"$f":"IF(L72=M72,\"\",'12.lan'!$D$240&VLOOKUP(L72,$C$102:$D$106,2,FALSE())&\" (\"&L72&\")\")","v":""},{"$f":"IF(K72=\"trifft nicht zu\",C106,'9. Weighting'!P37)","v":1}]
[null,"D4.1",{"$f":"'12.lan'!D172","v":"Customer participation, joint product development and market research"},{"$f":"C104","v":{"v":1,"d":"1.0"}},{"$f":"VLOOKUP(D73,$C$102:$D$106,2,FALSE())","v":"medium"},{"$f":"'12.lan'!$D$329","v":"Introduce value between 0 and 10"},null,0,{"$f":"IFERROR(J73*H73/10,0)","v":0},{"$f":"IFERROR($J$72*K73/(SUM($K$73:$K$74)),0)","v":{"v":22.2222222222222,"d":"22"}},{"$f":"VLOOKUP(D73,$C$102:$E$106,3,FALSE())","v":1},{"$f":"VLOOKUP(O73,$C$102:$E$106,3,FALSE())","v":1},{"$f":"VLOOKUP(D73,$C$102:$E$106,3,FALSE())","v":1},{"$f":"IF(L73=M73,\"\",'12.lan'!$D$240&VLOOKUP(L73,$C$102:$D$106,2,FALSE())&\" (\"&L73&\")\")","v":""},{"$f":"C104","v":1}]
[null,"D4.2",{"$f":"'12.lan'!D173","v":"Product transparency"},{"$f":"C104","v":{"v":1,"d":"1.0"}},{"$f":"VLOOKUP(D74,$C$102:$D$106,2,FALSE())","v":"medium"},{"$f":"'12.lan'!$D$329","v":"Introduce value between 0 and 10"},null,0,{"$f":"IFERROR(J74*H74/10,0)","v":0},{"$f":"IFERROR($J$72*K74/(SUM($K$73:$K$74)),0)","v":{"v":22.2222222222222,"d":"22"}},{"$f":"VLOOKUP(D74,$C$102:$E$106,3,FALSE())","v":1},{"$f":"VLOOKUP(O74,$C$102:$E$106,3,FALSE())","v":1},{"$f":"VLOOKUP(D74,$C$102:$E$106,3,FALSE())","v":1},{"$f":"IF(L74=M74,\"\",'12.lan'!$D$240&VLOOKUP(L74,$C$102:$D$106,2,FALSE())&\" (\"&L74&\")\")","v":""},{"$f":"C104","v":1}]
[null,"D4.2",{"$f":"'12.lan'!D174","v":"Negative aspect: non-disclosure of hazardous substances"},null,null,{"$f":"'12.lan'!$D$330","v":"Introduce negative points between 0 and -200"},null,0,{"$f":"H75*J72/50","v":0},{"$f":"-200*J72/50","v":{"v":-177.777777777778,"d":"-178"}}]
[null,"E",{"$f":"'12.lan'!D175","v":"Social environment"},{"$f":"L76","v":{"v":1,"d":"1.0"}},{"$f":"VLOOKUP(D76,$C$102:$D$106,2,FALSE())","v":"medium"},null,null,{"$f":"IFERROR(I76/J76,0)","v":{"v":0.3,"d":"30 %"}},{"$f":"I77+I81+I86+I90","v":{"v":53.3333333333333,"d":"53"}},{"$f":"J77+J81+J86+J90","v":{"v":177.777777777778,"d":"178"}},null,{"$f":"'9. Weighting'!K53","v":1},null,{"$f":"IF(D76<>L76,'12.lan'!$D$240&VLOOKUP(L76,$C$102:$D$106,2,FALSE())&\" (\"&L76&\")\",\"\")","v":""}]
[null,"E1",{"$f":"'12.lan'!D176","v":"Purpose of products and services and their effects on society"},{"$f":"IF(K77=\"trifft nicht zu\",C106,'9. Weighting'!M43)","v":{"v":1,"d":"1.0"}},{"$f":"VLOOKUP(D77,$C$102:$D$106,2,FALSE())","v":"medium"},{"$f":"IF(K77=\"trifft nicht zu\",\"trifft nicht zu\",'9. Weighting'!M43)","v":1},null,{"$f":"IF(J77<>0,ROUND(SUM(I78:I80)/J77,1),\"-\")","v":{"v":0,"d":"0 %"}},{"$f":"IF(J77=0,0,H77*J77)","v":0},{"$f":"'9. Weighting'!M42","v":{"v":44.4444444444444,"d":"44"}},{"$f":"IF(AND(D78=\"trifft nicht zu\",D79=\"trifft nicht zu\"),\"trifft nicht zu\",\"\")","v":""},{"$f":"VLOOKUP(O77,$C$102:$E$106,3,FALSE())","v":1},{"$f":"VLOOKUP(D77,$C$102:$E$106,3,FALSE())","v":1},{"$f":"IF(L77=M77,\"\",'12.lan'!$D$240&VLOOKUP(L77,$C$102:$D$106,2,FALSE())&\" (\"&L77&\")\")","v":""},{"$f":"IF(K77=\"trifft nicht zu\",C106,'9. Weighting'!M43)","v":1}]
[null,"E1.1",{"$f":"'12.lan'!D177","v":"Products and services should cover basic needs and contribute to a good life"},{"$f":"C104","v":{"v":1,"d":"1.0"}},{"$f":"VLOOKUP(D78,$C$102:$D$106,2,FALSE())","v":"medium"},{"$f":"'12.lan'!$D$329","v":"Introduce value between 0 and 10"},null,0,{"$f":"IFERROR(J78*H78/10,0)","v":0},{"$f":"IFERROR($J$77*K78/(SUM($K$78:$K$79)),0)","v":{"v":22.2222222222222,"d":"22"}},{"$f":"VLOOKUP(D78,$C$102:$E$106,3,FALSE())","v":1},{"$f":"VLOOKUP(O78,$C$102:$E$106,3,FALSE())","v":1},{"$f":"VLOOKUP(D78,$C$102:$E$106,3,FALSE())","v":1},{"$f":"IF(L78=M78,\"\",'12.lan'!$D$240&VLOOKUP(L78,$C$102:$D$106,2,FALSE())&\" (\"&L78&\")\")","v":""},{"$f":"C104","v":1}]
[null,"E1.2",{"$f":"'12.lan'!D178","v":"Social impact of products and services"},{"$f":"C104","v":{"v":1,"d":"1.0"}},{"$f":"VLOOKUP(D79,$C$102:$D$106,2,FALSE())","v":"medium"},{"$f":"'12.lan'!$D$329","v":"Introduce value between 0 and 10"},null,0,{"$f":"IFERROR(J79*H79/10,0)","v":0},{"$f":"IFERROR($J$77*K79/(SUM($K$78:$K$79)),0)","v":{"v":22.2222222222222,"d":"22"}},{"$f":"VLOOKUP(D79,$C$102:$E$106,3,FALSE())","v":1},{"$f":"VLOOKUP(O79,$C$102:$E$106,3,FALSE())","v":1},{"$f":"VLOOKUP(D79,$C$102:$E$106,3,FALSE())","v":1},{"$f":"IF(L79=M79,\"\",'12.lan'!$D$240&VLOOKUP(L79,$C$102:$D$106,2,FALSE())&\" (\"&L79&\")\")","v":""},{"$f":"C104","v":1}]
[null,"E1.3",{"$f":"'12.lan'!D179","v":"Negative aspect: unethical and unfit products and services"},null,null,{"$f":"'12.lan'!$D$330","v":"Introduce negative points between 0 and -200"},null,0,{"$f":"H80*J77/50","v":0},{"$f":"-200*J77/50","v":{"v":-177.777777777778,"d":"-178"}}]
[null,"E2",{"$f":"'12.lan'!D180","v":"Contribution to the community"},{"$f":"IF(K81=\"trifft nicht zu\",C106,'9. Weighting'!N43)","v":{"v":1,"d":"1.0"}},{"$f":"VLOOKUP(D81,$C$102:$D$106,2,FALSE())","v":"medium"},{"$f":"IF(K81=\"trifft nicht zu\",\"trifft nicht zu\",'9. Weighting'!N43)","v":1},null,{"$f":"IF(J81<>0,ROUND(SUM(I82:I85)/J81,1),\"-\")","v":{"v":0.2,"d":"20 %"}},{"$f":"IF(J81=0,0,H81*J81)","v":{"v":8.88888888888889,"d":"9"}},{"$f":"'9. Weighting'!N42","v":{"v":44.4444444444444,"d":"44"}},{"$f":"IF(AND(D82=\"trifft nicht zu\",D83=\"trifft nicht zu\"),\"trifft nicht zu\",\"\")","v":""},{"$f":"VLOOKUP(O81,$C$102:$E$106,3,FALSE())","v":1},{"$f":"VLOOKUP(D81,$C$102:$E$106,3,FALSE())","v":1},{"$f":"IF(L81=M81,\"\",'12.lan'!$D$240&VLOOKUP(L81,$C$102:$D$106,2,FALSE())&\" (\"&L81&\")\")","v":""},{"$f":"IF(K81=\"trifft nicht zu\",C106,'9. Weighting'!N43)","v":1}]
[null,"E2.1",{"$f":"'12.lan'!D181","v":"Taxes and social security contributions"},{"$f":"C104","v":{"v":1,"d":"1.0"}},{"$f":"VLOOKUP(D82,$C$102:$D$106,2,FALSE())","v":"medium"},{"$f":"'12.lan'!$D$329","v":"Introduce value between 0 and 10"},null,1,{"$f":"IFERROR(J82*H82/10,0)","v":{"v":2.22222222222222,"d":"2"}},{"$f":"IFERROR($J$81*K82/SUM($K$82:$K$83),0)","v":{"v":22.2222222222222,"d":"22"}},{"$f":"VLOOKUP(D82,$C$102:$E$106,3,FALSE())","v":1},{"$f":"VLOOKUP(O82,$C$102:$E$106,3,FALSE())","v":1},{"$f":"VLOOKUP(D82,$C$102:$E$106,3,FALSE())","v":1},{"$f":"IF(L82=M82,\"\",'12.lan'!$D$240&VLOOKUP(L82,$C$102:$D$106,2,FALSE())&\" (\"&L82&\")\")","v":""},{"$f":"C104","v":1}]
[null,"E2.2",{"$f":"'12.lan'!D182","v":"Voluntary contributions that strengthen society"},{"v":1,"d":"1.0"},{"$f":"VLOOKUP(D83,$C$102:$D$106,2,FALSE())","v":"medium"},{"$f":"'12.lan'!$D$329","v":"Introduce value between 0 and 10"},null,2,{"$f":"IFERROR(J83*H83/10,0)","v":{"v":4.44444444444444,"d":"4"}},{"$f":"IFERROR($J$81*K83/SUM($K$82:$K$83),0)","v":{"v":22.2222222222222,"d":"22"}},{"$f":"VLOOKUP(D83,$C$102:$E$106,3,FALSE())","v":1},{"$f":"VLOOKUP(O83,$C$102:$E$106,3,FALSE())","v":1},{"$f":"VLOOKUP(D83,$C$102:$E$106,3,FALSE())","v":1},{"$f":"IF(L83=M83,\"\",'12.lan'!$D$240&VLOOKUP(L83,$C$102:$D$106,2,FALSE())&\" (\"&L83&\")\")","v":""},{"$f":"C104","v":1}]
[null,"E2.3",{"$f":"'12.lan'!D183","v":"Negative aspect: inappropriate non-payment of tax"},null,null,{"$f":"'12.lan'!$D$330","v":"Introduce negative points between 0 and -200"},null,0,{"$f":"H84*J81/50","v":0},{"$f":"-200*J81/50","v":{"v":-177.777777777778,"d":"-178"}}]
[null,"E2.4",{"$f":"'12.lan'!D184","v":"Negative aspect: no anti-corruption policy"},null,null,{"$f":"'12.lan'!$D$330","v":"Introduce negative points between 0 and -200"},null,0,{"$f":"H85*J81/50","v":0},{"$f":"-200*J81/50","v":{"v":-177.777777777778,"d":"-178"}}]
[null,"E3",{"$f":"'12.lan'!D185","v":"Reduction of environmental impact"},{"$f":"IF(K86=\"trifft nicht zu\",C106,'9. Weighting'!O43)","v":{"v":1,"d":"1.0"}},{"$f":"VLOOKUP(D86,$C$102:$D$106,2,FALSE())","v":"medium"},null,null,{"$f":"IF(J86<>0,ROUND(SUM(I87:I89)/J86,1),\"-\")","v":{"v":0.4,"d":"40 %"}},{"$f":"IF(J86=0,0,H86*J86)","v":{"v":17.7777777777778,"d":"18"}},{"$f":"'9. Weighting'!O42","v":{"v":44.4444444444444,"d":"44"}},{"$f":"IF(AND(D87=\"trifft nicht zu\",D88=\"trifft nicht zu\"),\"trifft nicht zu\",\"\")","v":""},{"$f":"VLOOKUP(O86,$C$102:$E$106,3,FALSE())","v":1},{"$f":"VLOOKUP(D86,$C$102:$E$106,3,FALSE())","v":1},{"$f":"IF(L86=M86,\"\",'12.lan'!$D$240&VLOOKUP(L86,$C$102:$D$106,2,FALSE())&\" (\"&L86&\")\")","v":""},{"$f":"IF(K86=\"trifft nicht zu\",C106,'9. Weighting'!O43)","v":1}]
[null,"E3.1",{"$f":"'12.lan'!D186","v":"Absolute impact and management strategy"},{"$f":"C104","v":{"v":1,"d":"1.0"}},{"$f":"VLOOKUP(D87,$C$102:$D$106,2,FALSE())","v":"medium"},{"$f":"'12.lan'!$D$329","v":"Introduce value between 0 and 10"},null,3,{"$f":"IFERROR(J87*H87/10,0)","v":{"v":6.66666666666667,"d":"7"}},{"$f":"IFERROR(J86*K87/SUM($K$87:$K$88),0)","v":{"v":22.2222222222222,"d":"22"}},{"$f":"VLOOKUP(D87,$C$102:$E$106,3,FALSE())","v":1},{"$f":"VLOOKUP(O87,$C$102:$E$106,3,FALSE())","v":1},{"$f":"VLOOKUP(D87,$C$102:$E$106,3,FALSE())","v":1},{"$f":"IF(L87=M87,\"\",'12.lan'!$D$240&VLOOKUP(L87,$C$102:$D$106,2,FALSE())&\" (\"&L87&\")\")","v":""},{"$f":"C104","v":1}]
[null,"E3.2",{"$f":"'12.lan'!D187","v":"Relative impact"},{"$f":"C104","v":{"v":1,"d":"1.0"}},{"$f":"VLOOKUP(D88,$C$102:$D$106,2,FALSE())","v":"medium"},{"$f":"'12.lan'!$D$329","v":"Introduce value between 0 and 10"},null,4,{"$f":"IFERROR(J88*H88/10,0)","v":{"v":8.88888888888889,"d":"9"}},{"$f":"IFERROR(J86*K88/SUM($K$87:$K$88),0)","v":{"v":22.2222222222222,"d":"22"}},{"$f":"VLOOKUP(D88,$C$102:$E$106,3,FALSE())","v":1},{"$f":"VLOOKUP(O88,$C$102:$E$106,3,FALSE())","v":1},{"$f":"VLOOKUP(D88,$C$102:$E$106,3,FALSE())","v":1},{"$f":"IF(L88=M88,\"\",'12.lan'!$D$240&VLOOKUP(L88,$C$102:$D$106,2,FALSE())&\" (\"&L88&\")\")","v":""},{"$f":"C104","v":1}]
[null,"E3.3",{"$f":"'12.lan'!D188","v":"Negative aspect: infringement of environmental regulations and disproportionate environmental pollution"},null,null,{"$f":"'12.lan'!$D$330","v":"Introduce negative points between 0 and -200"},null,0,{"$f":"H89*J86/50","v":0},{"$f":"-200*J86/50","v":{"v":-177.777777777778,"d":"-178"}}]
[null,"E4",{"$f":"'12.lan'!D189","v":"Social co-determination and transparency"},{"$f":"IF(K90=\"trifft nicht zu\",C106,'9. Weighting'!P43)","v":{"v":1,"d":"1.0"}},{"$f":"VLOOKUP(D90,$C$102:$D$106,2,FALSE())","v":"medium"},null,null,{"$f":"IF(J90<>0,ROUND(SUM(I91:I93)/J90,1),\"-\")","v":{"v":0.6,"d":"60 %"}},{"$f":"IF(J90=0,0,H90*J90)","v":{"v":26.6666666666667,"d":"27"}},{"$f":"'9. Weighting'!P42","v":{"v":44.4444444444444,"d":"44"}},{"$f":"IF(AND(D91=\"trifft nicht zu\",D92=\"trifft nicht zu\"),\"trifft nicht zu\",\"\")","v":""},{"$f":"VLOOKUP(O90,$C$102:$E$106,3,FALSE())","v":1},{"$f":"VLOOKUP(D90,$C$102:$E$106,3,FALSE())","v":1},{"$f":"IF(L90=M90,\"\",'12.lan'!$D$240&VLOOKUP(L90,$C$102:$D$106,2,FALSE())&\" (\"&L90&\")\")","v":""},{"$f":"IF(K90=\"trifft nicht zu\",C106,'9. Weighting'!P43)","v":1}]
[null,"E4.1",{"$f":"'12.lan'!D190","v":"Transparency"},{"v":1,"d":"1.0"},{"$f":"VLOOKUP(D91,$C$102:$D$106,2,FALSE())","v":"medium"},{"$f":"'12.lan'!$D$329","v":"Introduce value between 0 and 10"},null,5,{"$f":"IFERROR(J91*H91/10,0)","v":{"v":11.1111111111111,"d":"11"}},{"$f":"IFERROR($J$90*K91/SUM($K$91:$K$92),0)","v":{"v":22.2222222222222,"d":"22"}},{"$f":"VLOOKUP(D91,$C$102:$E$106,3,FALSE())","v":1},{"$f":"VLOOKUP(O91,$C$102:$E$106,3,FALSE())","v":1},{"$f":"VLOOKUP(D91,$C$102:$E$106,3,FALSE())","v":1},{"$f":"IF(L91=M91,\"\",'12.lan'!$D$240&VLOOKUP(L91,$C$102:$D$106,2,FALSE())&\" (\"&L91&\")\")","v":""},{"$f":"C104","v":1}]
[null,"E4.2",{"$f":"'12.lan'!D191","v":"Social participation"},{"$f":"C104","v":{"v":1,"d":"1.0"}},{"$f":"VLOOKUP(D92,$C$102:$D$106,2,FALSE())","v":"medium"},{"$f":"'12.lan'!$D$329","v":"Introduce value between 0 and 10"},null,6,{"$f":"IFERROR(J92*H92/10,0)","v":{"v":13.3333333333333,"d":"13"}},{"$f":"IFERROR($J$90*K92/SUM($K$91:$K$92),0)","v":{"v":22.2222222222222,"d":"22"}},{"$f":"VLOOKUP(D92,$C$102:$E$106,3,FALSE())","v":1},{"$f":"VLOOKUP(O92,$C$102:$E$106,3,FALSE())","v":1},{"$f":"VLOOKUP(D92,$C$102:$E$106,3,FALSE())","v":1},{"$f":"IF(L92=M92,\"\",'12.lan'!$D$240&VLOOKUP(L92,$C$102:$D$106,2,FALSE())&\" (\"&L92&\")\")","v":""},{"$f":"C104","v":1}]
[null,"E4.3",{"$f":"'12.lan'!D192","v":"Negative aspect: lack of transparency and wilful misinformation"},null,null,{"$f":"'12.lan'!$D$330","v":"Introduce negative points between 0 and -200"},null,0,{"$f":"H93*J90/50","v":0},{"$f":"-200*J90/50","v":{"v":-177.777777777778,"d":"-178"}}]
[]
[null,{"$f":"'12.lan'!D92","v":"Total Balance Score:"},{"$nulls":5},{"$f":"H4","v":{"v":0.223333333333333,"d":"22 %"}},{"$f":"I4","v":{"v":223.333333333333,"d":"223"}},{"$f":"J4","v":1000}]
[]
[]
[]
[]
[]
[]
[null,2,2,{"$f":"'12.lan'!D97","v":"very high"},2]
[null,1.5,1.5,{"$f":"'12.lan'!D98","v":"high"},1.5]
[null,1,1,{"$f":"'12.lan'!D99","v":"medium"},1]
[null,0.5,0.5,{"$f":"'12.lan'!D100","v":"low"},0.5]
[null,0,0,{"$f":"'12.lan'!D101","v":"not applicable"},0]

{"sheet":"9. Weighting","index":4,"n_rows":70,"n_cols":19,"rows_kept":70,"hidden":true,"merged":[[3,4,5,9],[3,10,6,11],[3,12,7,12],[3,13,7,13],[3,14,7,14],[3,15,7,15],[6,5,6,6],[6,7,6,8],[7,5,7,9],[9,1,13,1],[9,5,9,7],[9,9,17,9],[9,10,17,10],[9,11,17,11],[9,12,10,12],[9,13,10,13],[9,14,10,14],[9,15,10,15],[10,5,10,8],[18,5,18,7],[18,9,23,9],[18,10,23,10],[18,11,23,11],[18,12,19,12],[18,13,19,13],[18,14,19,14],[18,15,19,15],[19,5,19,7],[20,5,20,7],[21,6,21,7],[22,6,22,7],[24,5,24,7],[24,9,30,9],[24,10,30,10],[24,11,30,11],[24,12,25,12],[24,13,25,13],[24,14,25,14],[24,15,25,15],[25,5,25,7],[29,5,29,7],[30,5,30,7],[31,5,31,7],[31,9,36,9],[31,10,36,10],[31,11,36,11],[31,12,32,12],[31,13,32,13],[31,14,32,14],[31,15,32,15],[37,9,41,9],[37,10,41,10],[37,11,41,11],[37,12,38,12],[37,13,38,13],[37,14,38,14],[37,15,38,15],[44,12,45,12],[44,13,45,13],[44,14,45,14],[44,15,45,15],[48,10,48,11],[49,10,49,11],[50,10,50,11],[51,10,51,11],[52,10,52,11],[57,1,57,16]]}
[]
[]
[]
[{"$nulls":4},"MATRIX 5.0",{"$nulls":5},"VALUES WERTE",null,"1) HUMAN DIGNITY ","2) SOLIDARITY &  JUSTICE","3) ECOLOGICAL SUSTAINABILITY","4) DEMOCRATIC CO-DETERMINATION AND TRANSPARENCY"]
[null,"Total Sales (in Mio Euro)"]
[null,"Total Assets (in Mio Euro)"]
[{"$nulls":7},"fields necessary to fill out",null,"these field contains a comment on the necesarry information for cells to be filled out or on the weighting in general"]
[{"$nulls":5},"STAKEHOLDER                                                    BERÜHRUNGSGGRUPPE"]
[{"$nulls":12},{"$f":"M15+M23+M29+M36+M42","v":{"v":255.555555555556,"d":"256"}},{"$f":"N15+N23+N29+N36+N42","v":{"v":244.444444444444,"d":"244"}},{"$f":"O15+O23+O29+O36+O42","v":{"v":255.555555555556,"d":"256"}},{"$f":"P15+P23+P29+P36+P42","v":{"v":244.444444444444,"d":"244"}}]
[{"$nulls":5},"Gesamt-Ausgaben an Lieferanten / total expenditures on the supply chain",null,null,{"$f":"'2. Company Facts'!C7","v":{"v":10000,"d":"10,000"}},"A: SUPPLIERS",{"$f":"K49","v":1},{"$f":"M15+N15+O15+P15","v":{"v":177.777777777778,"d":"178"}},"A1","A2","A3","A4"]
[]
[{"$nulls":4},"NACE","Industry","Product / Services Description","Region","Expenditures"]
[{"$nulls":4},{"$f":"LEFT(F13,2)","v":"Pl"},{"$f":"'2. Company Facts'!B10","v":"Please choose"},{"$f":"'2. Company Facts'!C10","v":"Please enter"},{"$f":"'2. Company Facts'!D10","v":"Please choose"},{"$f":"'2. Company Facts'!F10","v":{"v":500,"d":"500 "}}]
[{"$nulls":4},{"$f":"LEFT(F14,2)","v":"Pl"},{"$f":"'2. Company Facts'!B11","v":"Please choose"},{"$f":"'2. Company Facts'!C11","v":"Please enter"},{"$f":"'2. Company Facts'!D11","v":"Please choose"},{"$f":"'2. Company Facts'!F11","v":0},{"$nulls":3},{"$f":"'3. Calc'!D10","v":{"v":1,"d":"1.0"}},{"$f":"'3. Calc'!D13","v":{"v":1,"d":"1.0"}},{"$f":"'3. Calc'!D17","v":{"v":1,"d":"1.0"}},{"$f":"'3. Calc'!D20","v":{"v":1,"d":"1.0"}},{"$f":"'11.Region'!U10","v":0}]
[{"$nulls":4},{"$f":"LEFT(F15,2)","v":"Pl"},{"$f":"'2. Company Facts'!B12","v":"Please choose"},{"$f":"'2. Company Facts'!C12","v":"Please enter"},{"$f":"'2. Company Facts'!D12","v":"Please choose"},{"$f":"'2. Company Facts'!F12","v":0},{"$nulls":3},{"$f":"M49","v":{"v":44.4444444444444,"d":"44"}},{"$f":"N49","v":{"v":44.4444444444444,"d":"44"}},{"$f":"O49","v":{"v":44.4444444444444,"d":"44"}},{"$f":"P49","v":{"v":44.4444444444444,"d":"44"}}]
[{"$nulls":4},{"$f":"LEFT(F16,2)","v":"Pl"},{"$f":"'2. Company Facts'!B13","v":"Please choose"},{"$f":"'2. Company Facts'!C13","v":"Please enter"},{"$f":"'2. Company Facts'!D13","v":"Please choose"},{"$f":"'2. Company Facts'!F13","v":0},{"$nulls":3},{"$f":"'3. Calc'!C104","v":1},{"$f":"'3. Calc'!C104","v":1},{"$f":"IFERROR(IF('11.Region'!N8>1.5,'3. Calc'!C102,IF('11.Region'!N8>1.25,'3. Calc'!C103,IF('11.Region'!N8<0.75,'3. Calc'!C105,'3. Calc'!C104))),'3. Calc'!C104)","v":1},{"$f":"IF('11.Region'!I9<1.5,'3. Calc'!C105,IF('11.Region'!I9<3.26,'3. Calc'!C104,IF('11.Region'!I9<4.5,'3. Calc'!C103,'3. Calc'!C102)))","v":1}]
[{"$nulls":4},{"$f":"LEFT(F17,2)","v":"Pl"},{"$f":"'2. Company Facts'!B14","v":"Please choose"},{"$f":"'2. Company Facts'!C14","v":"Please enter"},{"$f":"'2. Company Facts'!D14","v":"Please choose"},{"$f":"'2. Company Facts'!F14","v":0}]
[{"$nulls":5},"Rest",null,{"$f":"'2. Company Facts'!D15","v":"Please choose"},{"$f":"'2. Company Facts'!F15","v":{"v":9500,"d":"9,500 "}}]
[{"$nulls":5},"profit ",null,null,{"$f":"'2. Company Facts'!C18","v":{"v":500,"d":"500 "}},"B: INVESTORS",{"$f":"K50","v":0.5},{"$f":"M23+N23+O23+P23","v":{"v":111.111111111111,"d":"111"}},"B1","B2","B3","B4"]
[{"$nulls":5},"profit in % of total Sales ",null,null,{"$f":"IFERROR(I19/I32,\"-\")","v":"-"},{"$nulls":4},"profit",null,"EQ-Quote"]
[{"$nulls":5},"costs of finance",null,null,{"$f":"'2. Company Facts'!C19","v":{"v":12,"d":"12 "}}]
[{"$nulls":4},{"$f":"IFERROR((G24+I24)/I23,0.2)","v":{"v":2.75,"d":"2.750"}},"<-- (zugänge anlageverm.+financial assets)/total assets","finance income",null,{"$f":"'2. Company Facts'!C20","v":23},{"$nulls":3},{"$f":"'3. Calc'!D24","v":1.5},{"$f":"'3. Calc'!D28","v":{"v":1,"d":"1.0"}},{"$f":"'3. Calc'!D31","v":1.5},{"$f":"'3. Calc'!D35","v":{"v":1,"d":"1.0"}}]
[{"$nulls":4},{"$f":"IFERROR(I32/I23,0.3)","v":{"v":0,"d":"0.0"}},"<-- ratio: sales/assets","total assets",null,{"$f":"'2. Company Facts'!C21","v":{"v":44,"d":"44 "}},{"$nulls":3},{"$f":"M50","v":{"v":33.3333333333333,"d":"33"}},{"$f":"N50","v":{"v":22.2222222222222,"d":"22"}},{"$f":"O50","v":{"v":33.3333333333333,"d":"33"}},{"$f":"P50","v":{"v":22.2222222222222,"d":"22"}}]
[{"$nulls":5},"\"zugänge zum anlagevermögen\"",{"$f":"'2. Company Facts'!C22","v":{"v":55,"d":"55 "}},"\"invested money\"",{"$f":"'2. Company Facts'!C23","v":{"v":66,"d":"66 "}},{"$nulls":3},{"$f":"IFERROR(IF(H35='10. Industry'!A22,'3. Calc'!C102,IF(E23<0.1,'3. Calc'!C103,IF(E23>0.5,'3. Calc'!C105,'3. Calc'!C104))),'3. Calc'!C104)","v":1.5},{"$f":"IFERROR(IF(I20=\"-\",'3. Calc'!C104,IF(I20>0.1,'3. Calc'!C103,IF(I20<0.001,'3. Calc'!C106,IF(I20<0.03,'3. Calc'!C105,'3. Calc'!C104)))),'3. Calc'!C104)","v":1},{"$f":"IFERROR(IF(H35='10. Industry'!A22,'3. Calc'!C102,IF(E22<0.1,'3. Calc'!C105,IF(E22>0.25,'3. Calc'!C103,'3. Calc'!C104))),'3. Calc'!C104)","v":1.5},{"$f":"IF(H40=\"Kleinstunternehmen\",'3. Calc'!C105,'3. Calc'!C104)","v":1}]
[{"$nulls":5},"employee expenditures",null,null,{"$f":"'2. Company Facts'!C27","v":{"v":33333,"d":"33,333 "}},"C: EMPLOYEES",{"$f":"K51","v":2},{"$f":"M29+N29+O29+P29","v":{"v":355.555555555556,"d":"356"}},"C1","C2","C3","C4"]
[{"$nulls":5},"number of FTE ",null,null,{"$f":"'2. Company Facts'!C26","v":{"v":1234,"d":"1,234 "}},{"$nulls":5},"Does an Cantine for the majority of employees exist?","companay szie"]
[{"$nulls":6},"% employees  in ",{"$f":"'2. Company Facts'!B30","v":"Please choose"},{"$f":"'2. Company Facts'!D30","v":{"v":0,"d":"0 %"}}]
[{"$nulls":6},"% employees in ",{"$f":"'2. Company Facts'!B31","v":"Please choose"},{"$f":"'2. Company Facts'!D31","v":{"v":0,"d":"0 %"}},{"$nulls":3},{"$f":"'3. Calc'!D39","v":{"v":1,"d":"1.0"}},{"$f":"'3. Calc'!D44","v":{"v":1,"d":"1.0"}},{"$f":"'3. Calc'!D49","v":{"v":1,"d":"1.0"}},{"$f":"'3. Calc'!D54","v":{"v":1,"d":"1.0"}}]
[{"$nulls":6},"% employees in ",{"$f":"'2. Company Facts'!B32","v":"Please choose"},{"$f":"'2. Company Facts'!D32","v":{"v":0,"d":"0 %"}},{"$nulls":3},{"$f":"M51","v":{"v":88.8888888888889,"d":"89"}},{"$f":"N51","v":{"v":88.8888888888889,"d":"89"}},{"$f":"O51","v":{"v":88.8888888888889,"d":"89"}},{"$f":"P51","v":{"v":88.8888888888889,"d":"89"}}]
[{"$nulls":5},"potential commuting impact",null,null,{"$f":"'2. Company Facts'!C33","v":0},{"$nulls":3},{"$f":"'3. Calc'!C104","v":1},{"$f":"'3. Calc'!C104","v":1},{"$f":"IF(AND(OR(I31=\"Nein\",I31=\"No\",I31=\"Nao\",I31=\"Pas\"),I30<10),'3. Calc'!C105,IF(I30>25,'3. Calc'!C103,'3. Calc'!C104))","v":1},{"$f":"IF(I26=1,'3. Calc'!C106,IF(H40=\"Kleinstunternehmen\",'3. Calc'!C105,IF('11.Region'!I14>3.25,'3. Calc'!C103,'3. Calc'!C104)))","v":1}]
[{"$nulls":5},"existence of a company canteen",null,null,{"$f":"'2. Company Facts'!C34","v":{"v":0,"d":"0 %"}}]
[{"$nulls":5},"total sales",null,null,{"$f":"'2. Company Facts'!C37","v":0},"D: CUSTOMERS",1,{"$f":"M36+N36+O36+P36","v":{"v":177.777777777778,"d":"178"}},"D1","D2","D3","D4"]
[{"$nulls":7},"B2B / B2C",{"$f":"'2. Company Facts'!C38","v":0}]
[{"$nulls":5},"Industry","Product / Services Description","industry","% of total sales"]
[{"$nulls":5},{"$f":"'2. Company Facts'!B41","v":"Please choose"},{"$f":"'2. Company Facts'!C41","v":0},{"$f":"LEFT(F35,2)","v":"Pl"},{"$f":"'2. Company Facts'!D41","v":{"v":0,"d":"0 %"}},{"$nulls":3},{"$f":"'3. Calc'!D60","v":{"v":1,"d":"1.0"}},{"$f":"'3. Calc'!D64","v":{"v":1,"d":"1.0"}},{"$f":"'3. Calc'!D68","v":{"v":1,"d":"1.0"}},{"$f":"'3. Calc'!D72","v":{"v":1,"d":"1.0"}}]
[{"$nulls":5},{"$f":"'2. Company Facts'!B42","v":"Please choose"},{"$f":"'2. Company Facts'!C42","v":0},{"$f":"LEFT(F36,2)","v":"Pl"},{"$f":"'2. Company Facts'!D42","v":{"v":0,"d":"0 %"}},{"$nulls":3},{"$f":"M52","v":{"v":44.4444444444444,"d":"44"}},{"$f":"N52","v":{"v":44.4444444444444,"d":"44"}},{"$f":"O52","v":{"v":44.4444444444444,"d":"44"}},{"$f":"P52","v":{"v":44.4444444444444,"d":"44"}}]
[{"$nulls":5},{"$f":"'2. Company Facts'!B43","v":"Please choose"},{"$f":"'2. Company Facts'!C43","v":0},{"$f":"LEFT(F37,2)","v":"Pl"},{"$f":"'2. Company Facts'!D43","v":{"v":0,"d":"0 %"}},{"$nulls":3},{"$f":"'3. Calc'!C104","v":1},{"$f":"'3. Calc'!C104","v":1},{"$f":"VLOOKUP(S37,'3. Calc'!$B$102:$C$106,2,FALSE())","v":1},{"$f":"IFERROR(IF(I33=\"Ja\",'3. Calc'!C103,'3. Calc'!C104),'3. Calc'!C104)","v":1},null,null,{"$f":"VLOOKUP('10. Industry'!J39,F49:H53,3,FALSE())","v":1}]
[{"$nulls":9},"E: SOCIETY",1,{"$f":"M42+N42+O42+P42","v":{"v":177.777777777778,"d":"178"}},"E1","E2","E3","E4"]
[{"$nulls":7},{"$f":"IF(AND(I26<10,OR(I32<=2000000,I23<=2000000)),'12.lan'!D324,IF(AND(I26<50,OR(I32<=10000000,I23<=10000000)),'12.lan'!D325,IF(AND(I26<250,OR(I32<=50000000,I23<=43000000)),'12.lan'!D326,'12.lan'!D327)))","v":"Large business"}]
[{"$nulls":5},"Company Size (EU definition)",null,{"$f":"IF(AND(I26=0,I32=0,I23=0),'12.lan'!E326)","v":0}]
[{"$nulls":12},{"$f":"'3. Calc'!D77","v":{"v":1,"d":"1.0"}},{"$f":"'3. Calc'!D81","v":{"v":1,"d":"1.0"}},{"$f":"'3. Calc'!D86","v":{"v":1,"d":"1.0"}},{"$f":"'3. Calc'!D90","v":{"v":1,"d":"1.0"}}]
[{"$nulls":12},{"$f":"M53","v":{"v":44.4444444444444,"d":"44"}},{"$f":"N53","v":{"v":44.4444444444444,"d":"44"}},{"$f":"O53","v":{"v":44.4444444444444,"d":"44"}},{"$f":"P53","v":{"v":44.4444444444444,"d":"44"}}]
[{"$nulls":12},{"$f":"'3. Calc'!C104","v":1},{"$f":"IF(I20=\"-\",'3. Calc'!C104,IF(I20<0.05,'3. Calc'!C105,IF(I20<0.1,'3. Calc'!C104,IF(I20>0.1,'3. Calc'!C103,'3. Calc'!C104))))","v":1},{"$f":"VLOOKUP(S37,'3. Calc'!$B$102:$C$106,2,FALSE())","v":1},{"$f":"IF(H35=\"B\",'3. Calc'!C103,IF(H35=\"F\",'3. Calc'!C103,IF(H40=\"Kleinstunternehmen\",'3. Calc'!C105,IF(H40=\"Kleinunternehmen\",'3. Calc'!C105,'3. Calc'!C104))))","v":1},null,null,{"$f":"VLOOKUP('10. Industry'!L39,F49:H53,3,FALSE())","v":1}]
[]
[{"$nulls":12},"1) HUMAN DIGNITY","2) COOPERATION AND SOLIDARITY","3) ECOLOGICAL SUSTAINABILITY","5) DEMOCRATIC CO-DETERMINATION AND TRANSPARENCY"]
[]
[]
[{"$nulls":5},"Weighting Points",{"$nulls":11},"Selected Weighting"]
[{"$nulls":5},"trifft nicht zu",null,0,{"$f":"IFERROR((60*'11.Region'!G3/('11.Region'!G3+'11.Region'!G10+(I19+I21+I22+G24))*5),100)","v":{"v":68.2807478872795,"d":"68"}},{"$f":"IF(I49<60,60,IF(I49>300,300,I49))","v":{"v":68.2807478872795,"d":"68"}},{"$f":"IFERROR(IF(J49=60,0.5,IF(J49=300,2,IF(J49<180,1,1.5))),1)","v":1},null,{"$f":"M62/$Q$67*1000","v":{"v":44.4444444444444,"d":"44"}},{"$f":"N62/$Q$67*1000","v":{"v":44.4444444444444,"d":"44"}},{"$f":"O62/$Q$67*1000","v":{"v":44.4444444444444,"d":"44"}},{"$f":"P62/$Q$67*1000","v":{"v":44.4444444444444,"d":"44"}},{"$f":"SUM(M49:P49)","v":{"v":177.777777777778,"d":"178"}},{"$f":"'3. Calc'!D9","v":1}]
[{"$nulls":5},"niedrig",null,0.5,{"$f":"IFERROR((60*(I19+I21+I22+G24)/('11.Region'!G3+'11.Region'!G10+(I19+I21+I22+G24))*10),100)","v":{"v":8.23807036010325,"d":"8"}},{"$f":"IF(I50<60,60,IF(I50>300,300,I50))","v":60},{"$f":"IFERROR(IF(J50=60,0.5,IF(J50=300,2,IF(J50<180,1,1.5))),1)","v":0.5},null,{"$f":"M63/$Q$67*1000","v":{"v":33.3333333333333,"d":"33"}},{"$f":"N63/$Q$67*1000","v":{"v":22.2222222222222,"d":"22"}},{"$f":"O63/$Q$67*1000","v":{"v":33.3333333333333,"d":"33"}},{"$f":"P63/$Q$67*1000","v":{"v":22.2222222222222,"d":"22"}},{"$f":"SUM(M50:P50)","v":{"v":111.111111111111,"d":"111"}},{"$f":"'3. Calc'!D23","v":0.5}]
[{"$nulls":5},"mittel",null,1,{"$f":"IFERROR((60*'11.Region'!G10/('11.Region'!G3+'11.Region'!G10+(I19+I21+I22+G24))*10),100)","v":{"v":455.200433865338,"d":"455"}},{"$f":"IF(I51<60,60,IF(I51>300,300,I51))","v":300},{"$f":"IFERROR(IF(J51=60,0.5,IF(J51=300,2,IF(J51<180,1,1.5))),1)","v":2},null,{"$f":"M64/$Q$67*1000","v":{"v":88.8888888888889,"d":"89"}},{"$f":"N64/$Q$67*1000","v":{"v":88.8888888888889,"d":"89"}},{"$f":"O64/$Q$67*1000","v":{"v":88.8888888888889,"d":"89"}},{"$f":"P64/$Q$67*1000","v":{"v":88.8888888888889,"d":"89"}},{"$f":"SUM(M51:P51)","v":{"v":355.555555555556,"d":"356"}},{"$f":"'3. Calc'!D38","v":2}]
[{"$nulls":5},"hoch",null,1.5,null,null,{"$f":"K32","v":1},null,{"$f":"M65/$Q$67*1000","v":{"v":44.4444444444444,"d":"44"}},{"$f":"N65/$Q$67*1000","v":{"v":44.4444444444444,"d":"44"}},{"$f":"O65/$Q$67*1000","v":{"v":44.4444444444444,"d":"44"}},{"$f":"P65/$Q$67*1000","v":{"v":44.4444444444444,"d":"44"}},{"$f":"SUM(M52:P52)","v":{"v":177.777777777778,"d":"178"}},{"$f":"'3. Calc'!D59","v":1}]
[{"$nulls":5},"sehr hoch",null,2,null,null,{"$f":"K38","v":1},null,{"$f":"M66/$Q$67*1000","v":{"v":44.4444444444444,"d":"44"}},{"$f":"N66/$Q$67*1000","v":{"v":44.4444444444444,"d":"44"}},{"$f":"O66/$Q$67*1000","v":{"v":44.4444444444444,"d":"44"}},{"$f":"P66/$Q$67*1000","v":{"v":44.4444444444444,"d":"44"}},{"$f":"SUM(M53:P53)","v":{"v":177.777777777778,"d":"178"}},{"$f":"'3. Calc'!D76","v":1}]
[{"$nulls":12},{"$f":"SUM(M49:M53)","v":{"v":255.555555555556,"d":"256"}},{"$f":"SUM(N49:N53)","v":{"v":244.444444444444,"d":"244"}},{"$f":"SUM(O49:O53)","v":{"v":255.555555555556,"d":"256"}},{"$f":"SUM(P49:P53)","v":{"v":244.444444444444,"d":"244"}},{"$f":"SUM(Q49:Q53)","v":1000}]
[]
[]
[]
[]
[{"$nulls":12},"1) HUMAN DIGNITY","2) COOPERATION AND SOLIDARITY","3) ECOLOGICAL SUSTAINABILITY","5) DEMOCRATIC CO-DETERMINATION AND TRANSPARENCY"]
[]
[{"$nulls":12},1,1,1,1]
[{"$nulls":10},{"$f":"IF(K49=R49,K49,R49)","v":{"v":1,"d":"1.0 "}},null,{"$f":"M14*$K$62","v":{"v":1,"d":"1.0"}},{"$f":"N14*$K$62","v":{"v":1,"d":"1.0"}},{"$f":"O14*$K$62","v":{"v":1,"d":"1.0"}},{"$f":"P14*$K$62","v":{"v":1,"d":"1.0"}},{"$f":"SUM(M62:P62)","v":4}]
[{"$nulls":10},{"$f":"IF(K50=R50,K50,R50)","v":{"v":0.5,"d":"0.5 "}},null,{"$f":"M22*$K$63","v":{"v":0.75,"d":"0.8"}},{"$f":"N22*$K$63","v":0.5},{"$f":"O22*$K$63","v":{"v":0.75,"d":"0.8"}},{"$f":"P22*$K$63","v":0.5},{"$f":"SUM(M63:P63)","v":{"v":2.5,"d":"3"}}]
[{"$nulls":10},{"$f":"IF(K51=R51,K51,R51)","v":{"v":2,"d":"2.0 "}},null,{"$f":"M28*$K$64","v":{"v":2,"d":"2.0"}},{"$f":"N28*$K$64","v":{"v":2,"d":"2.0"}},{"$f":"O28*$K$64","v":{"v":2,"d":"2.0"}},{"$f":"P28*$K$64","v":{"v":2,"d":"2.0"}},{"$f":"SUM(M64:P64)","v":8}]
[{"$nulls":10},{"$f":"IF(K52=R52,K52,R52)","v":{"v":1,"d":"1.0 "}},null,{"$f":"M35*K65","v":{"v":1,"d":"1.0"}},{"$f":"N35*K65","v":{"v":1,"d":"1.0"}},{"$f":"O35*K65","v":{"v":1,"d":"1.0"}},{"$f":"P35*K65","v":{"v":1,"d":"1.0"}},{"$f":"SUM(M65:P65)","v":4}]
[{"$nulls":10},{"$f":"IF(K53=R53,K53,R53)","v":{"v":1,"d":"1.0 "}},null,{"$f":"M41*K66","v":{"v":1,"d":"1.0"}},{"$f":"N41*K66","v":{"v":1,"d":"1.0"}},{"$f":"O41*K66","v":{"v":1,"d":"1.0"}},{"$f":"P41*K66","v":{"v":1,"d":"1.0"}},{"$f":"SUM(M66:P66)","v":4}]
[{"$nulls":12},{"$f":"SUM(M62:M66)","v":{"v":5.75,"d":"6"}},{"$f":"SUM(N62:N66)","v":{"v":5.5,"d":"6"}},{"$f":"SUM(O62:O66)","v":{"v":5.75,"d":"6"}},{"$f":"SUM(P62:P66)","v":{"v":5.5,"d":"6"}},{"$f":"SUM(Q62:Q66)","v":{"v":22.5,"d":"23"}}]
[]
[]
[null,"DIFFERENCE TO MATRIX 4.0 WEIGHTING"]

{"sheet":"4. ECG-Matrix","index":5,"n_rows":17,"n_cols":18,"rows_kept":17,"merged":[[1,8,1,14],[2,1,3,6],[3,8,4,9],[3,10,4,11],[3,12,4,14],[5,12,5,14],[6,2,6,5],[6,6,6,9],[6,10,6,13],[6,14,6,17],[7,1,8,1],[7,2,7,5],[7,6,7,9],[7,10,7,13],[7,14,7,17],[9,1,10,1],[9,2,9,5],[9,6,9,9],[9,10,9,13],[9,14,9,17],[11,1,12,1],[11,2,11,5],[11,6,11,9],[11,10,11,13],[11,14,11,17],[13,1,14,1],[13,2,13,5],[13,6,13,9],[13,10,13,13],[13,14,13,17],[15,1,16,1],[15,2,15,5],[15,6,15,9],[15,10,15,13],[15,14,15,17]]}
[]
[null,{"$f":"'12.lan'!D91&\" - \"&'0. Intro'!B3&\" \"&'0. Intro'!C3","v":"Common Good Balance Calculator - Version 5.04"},{"$nulls":6},{"$f":"'12.lan'!D212","v":"Note: This is not a certificate."}]
[null,{"$f":"'12.lan'!D213","v":"COMMON GOOD MATRIX"}]
[{"$nulls":8},{"$f":"'12.lan'!D92","v":"Total Balance Score:"},null,{"$f":"'3. Calc'!I4","v":{"v":223.333333333333,"d":"223"}},null,{"$f":"'12.lan'!D214&\" \"&'3. Calc'!$J$4&'12.lan'!D215","v":"of 1000points"}]
[null,{"$f":"'12.lan'!D82&\": \"&'1. General'!C6&\"; \"&'12.lan'!D83&\": \"&'1. General'!C12","v":"Company / Organisation: company; Period under review:"}]
[]
[null,{"$f":"'12.lan'!D206","v":"Values ►\nStakekolders ▼"},{"$f":"'12.lan'!D216","v":"Human dignity"},{"$nulls":3},{"$f":"'12.lan'!D217","v":"Solidarity & social justice"},{"$nulls":3},{"$f":"'12.lan'!D218","v":"Environmental sustainability"},{"$nulls":3},{"$f":"'12.lan'!D219","v":"Transparency & co-determination"}]
[null,{"$f":"\"A: \"&'12.lan'!D108","v":"A: Suppliers"},{"$f":"'12.lan'!B109","v":"A1: Human dignity in the supply chain"},{"$nulls":3},{"$f":"'12.lan'!B112","v":"A2: Solidarity and social justice in the supply chain"},{"$nulls":3},{"$f":"'12.lan'!B116","v":"A3: Environmental sustainability in the supply chain"},{"$nulls":3},{"$f":"'12.lan'!B119","v":"A4: Transparency & co-determination in the supply chain"}]
[null,null,{"$f":"'3. Calc'!I10","v":{"v":4.44444444444444,"d":"4"}},{"$f":"'12.lan'!$D$214","v":"of"},{"$f":"'3. Calc'!J10","v":{"v":44.4444444444444,"d":"44"}},{"$f":"'3. Calc'!H10","v":{"v":0.1,"d":"10 %"}},{"$f":"'3. Calc'!I13","v":{"v":4.44444444444444,"d":"4"}},{"$f":"'12.lan'!$D$214","v":"of"},{"$f":"'3. Calc'!J13","v":{"v":44.4444444444444,"d":"44"}},{"$f":"'3. Calc'!H13","v":{"v":0.1,"d":"10 %"}},{"$f":"'3. Calc'!I17","v":{"v":4.44444444444444,"d":"4"}},{"$f":"'12.lan'!$D$214","v":"of"},{"$f":"'3. Calc'!J17","v":{"v":44.4444444444444,"d":"44"}},{"$f":"'3. Calc'!H17","v":{"v":0.1,"d":"10 %"}},{"$f":"'3. Calc'!I20","v":{"v":26.6666666666667,"d":"27"}},{"$f":"'12.lan'!$D$214","v":"of"},{"$f":"'3. Calc'!J20","v":{"v":44.4444444444444,"d":"44"}},{"$f":"'3. Calc'!H20","v":{"v":0.6,"d":"60 %"}}]
[null,{"$f":"\"B: \"&'12.lan'!D122","v":"B: Owners, equity- and financial service providers"},{"$f":"'12.lan'!B123","v":"B1: Ethical position in relation to financial resources"},{"$nulls":3},{"$f":"'12.lan'!B127","v":"B2: Social position in relation to financial resources"},{"$nulls":3},{"$f":"'12.lan'!B130","v":"B3: Use of funds in relation to social and environmental impacts"},{"$nulls":3},{"$f":"'12.lan'!B134&IF('9. Weighting'!I28=1,'12.lan'!D211,\"\")","v":"B4: Ownership and co-determination"}]
[null,null,{"$f":"'3. Calc'!I24","v":{"v":26.6666666666667,"d":"27"}},{"$f":"'12.lan'!$D$214","v":"of"},{"$f":"'3. Calc'!J24","v":{"v":33.3333333333333,"d":"33"}},{"$f":"'3. Calc'!H24","v":{"v":0.8,"d":"80 %"}},{"$f":"'3. Calc'!I28","v":{"v":2.22222222222222,"d":"2"}},{"$f":"'12.lan'!$D$214","v":"of"},{"$f":"'3. Calc'!J28","v":{"v":22.2222222222222,"d":"22"}},{"$f":"'3. Calc'!H28","v":{"v":0.1,"d":"10 %"}},{"$f":"'3. Calc'!I31","v":10},{"$f":"'12.lan'!$D$214","v":"of"},{"$f":"'3. Calc'!J31","v":{"v":33.3333333333333,"d":"33"}},{"$f":"'3. Calc'!H31","v":{"v":0.3,"d":"30 %"}},{"$f":"'3. Calc'!I35","v":{"v":2.22222222222222,"d":"2"}},{"$f":"'12.lan'!$D$214","v":"of"},{"$f":"'3. Calc'!J35","v":{"v":22.2222222222222,"d":"22"}},{"$f":"'3. Calc'!H35","v":{"v":0.1,"d":"10 %"}}]
[null,{"$f":"\"C: \"&'12.lan'!D137","v":"C: Employees"},{"$f":"'12.lan'!B138","v":"C1: Human dignity in the workplace and working environment"},{"$nulls":3},{"$f":"'12.lan'!B143","v":"C2: Self-determined working arrangements"},{"$nulls":3},{"$f":"'12.lan'!B148","v":"C3: Environmentally-friendly behaviour of staff"},{"$nulls":3},{"$f":"'12.lan'!B153","v":"C4: Co-determination and transparency within the organisation"}]
[null,null,{"$f":"'3. Calc'!I39","v":{"v":17.7777777777778,"d":"18"}},{"$f":"'12.lan'!$D$214","v":"of"},{"$f":"'3. Calc'!J39","v":{"v":88.8888888888889,"d":"89"}},{"$f":"'3. Calc'!H39","v":{"v":0.2,"d":"20 %"}},{"$f":"'3. Calc'!I44","v":{"v":17.7777777777778,"d":"18"}},{"$f":"'12.lan'!$D$214","v":"of"},{"$f":"'3. Calc'!J44","v":{"v":88.8888888888889,"d":"89"}},{"$f":"'3. Calc'!H44","v":{"v":0.2,"d":"20 %"}},{"$f":"'3. Calc'!I49","v":{"v":17.7777777777778,"d":"18"}},{"$f":"'12.lan'!$D$214","v":"of"},{"$f":"'3. Calc'!J49","v":{"v":88.8888888888889,"d":"89"}},{"$f":"'3. Calc'!H49","v":{"v":0.2,"d":"20 %"}},{"$f":"'3. Calc'!I54","v":{"v":17.7777777777778,"d":"18"}},{"$f":"'12.lan'!$D$214","v":"of"},{"$f":"'3. Calc'!J54","v":{"v":88.8888888888889,"d":"89"}},{"$f":"'3. Calc'!H54","v":{"v":0.2,"d":"20 %"}}]
[null,{"$f":"\"D: \"&'12.lan'!D158","v":"D: Customers and other companies"},{"$f":"'12.lan'!B159","v":"D1: Ethical customer relations"},{"$nulls":3},{"$f":"'12.lan'!B163","v":"D2: Cooperation and solidarity with other companies"},{"$nulls":3},{"$f":"'12.lan'!B167","v":"D3: Impact on the environment of the use and disposal of products and services"},{"$nulls":3},{"$f":"'12.lan'!B171","v":"D4: Customer participation and product transparency"}]
[null,null,{"$f":"'3. Calc'!I60","v":0},{"$f":"'12.lan'!$D$214","v":"of"},{"$f":"'3. Calc'!J60","v":{"v":44.4444444444444,"d":"44"}},{"$f":"'3. Calc'!H60","v":{"v":0,"d":"0 %"}},{"$f":"'3. Calc'!I64","v":{"v":17.7777777777778,"d":"18"}},{"$f":"'12.lan'!$D$214","v":"of"},{"$f":"'3. Calc'!J64","v":{"v":44.4444444444444,"d":"44"}},{"$f":"'3. Calc'!H64","v":{"v":0.4,"d":"40 %"}},{"$f":"'3. Calc'!I68","v":0},{"$f":"'12.lan'!$D$214","v":"of"},{"$f":"'3. Calc'!J68","v":{"v":44.4444444444444,"d":"44"}},{"$f":"'3. Calc'!H68","v":{"v":0,"d":"0 %"}},{"$f":"'3. Calc'!I72","v":0},{"$f":"'12.lan'!$D$214","v":"of"},{"$f":"'3. Calc'!J72","v":{"v":44.4444444444444,"d":"44"}},{"$f":"'3. Calc'!H72","v":{"v":0,"d":"0 %"}}]
[null,{"$f":"\"E: \"&'12.lan'!D175","v":"E: Social environment"},{"$f":"'12.lan'!B176","v":"E1: Purpose of products and services and their effects on society"},{"$nulls":3},{"$f":"'12.lan'!B180","v":"E2: Contribution to the community"},{"$nulls":3},{"$f":"'12.lan'!B185","v":"E3: Reduction of environmental impact"},{"$nulls":3},{"$f":"'12.lan'!B189","v":"E4: Social co-determination and transparency"}]
[null,null,{"$f":"'3. Calc'!I77","v":0},{"$f":"'12.lan'!$D$214","v":"of"},{"$f":"'3. Calc'!J77","v":{"v":44.4444444444444,"d":"44"}},{"$f":"'3. Calc'!H77","v":{"v":0,"d":"0 %"}},{"$f":"'3. Calc'!I81","v":{"v":8.88888888888889,"d":"9"}},{"$f":"'12.lan'!$D$214","v":"of"},{"$f":"'3. Calc'!J81","v":{"v":44.4444444444444,"d":"44"}},{"$f":"'3. Calc'!H81","v":{"v":0.2,"d":"20 %"}},{"$f":"'3. Calc'!I86","v":{"v":17.7777777777778,"d":"18"}},{"$f":"'12.lan'!$D$214","v":"of"},{"$f":"'3. Calc'!J86","v":{"v":44.4444444444444,"d":"44"}},{"$f":"'3. Calc'!H86","v":{"v":0.4,"d":"40 %"}},{"$f":"'3. Calc'!I90","v":{"v":26.6666666666667,"d":"27"}},{"$f":"'12.lan'!$D$214","v":"of"},{"$f":"'3. Calc'!J90","v":{"v":44.4444444444444,"d":"44"}},{"$f":"'3. Calc'!H90","v":{"v":0.6,"d":"60 %"}}]

{"sheet":"5. Values","index":6,"n_rows":22,"n_cols":7,"rows_kept":22,"merged":[[1,1,1,5],[2,1,3,5],[14,1,14,5],[15,1,15,5],[16,1,16,5]]}
[]
[null,{"$f":"'12.lan'!D91&\" - \"&'0. Intro'!B3&\" \"&'0. Intro'!C3","v":"Common Good Balance Calculator - Version 5.04"}]
[null,{"$f":"'12.lan'!D241&'1. General'!C6","v":"Values star for company"}]
{"$rows_empty":13}
[null,{"$f":"'12.lan'!D221","v":"BALANCE OVERVIEW"}]
[null,{"$f":"'12.lan'!D216","v":"Human dignity"},{"$f":"'4. ECG-Matrix'!C9+'4. ECG-Matrix'!C11+'4. ECG-Matrix'!C13+'4. ECG-Matrix'!C15+'4. ECG-Matrix'!C17","v":{"v":48.8888888888889,"d":"49"}},{"$f":"'12.lan'!$D$214","v":"of"},{"$f":"'4. ECG-Matrix'!E9+'4. ECG-Matrix'!E11+'4. ECG-Matrix'!E13+'4. ECG-Matrix'!E15+'4. ECG-Matrix'!E17","v":{"v":255.555555555556,"d":"256"}},{"$f":"C18/E18","v":{"v":0.191304347826087,"d":"19 %"}},{"$f":"IF(F18<0,0,F18)","v":{"v":0.191304347826087,"d":"19 %"}}]
[null,{"$f":"'12.lan'!D217","v":"Solidarity & social justice"},{"$f":"'4. ECG-Matrix'!G9+'4. ECG-Matrix'!G11+'4. ECG-Matrix'!G13+'4. ECG-Matrix'!G15+'4. ECG-Matrix'!G17","v":{"v":51.1111111111111,"d":"51"}},{"$f":"'12.lan'!$D$214","v":"of"},{"$f":"'4. ECG-Matrix'!I9+'4. ECG-Matrix'!I11+'4. ECG-Matrix'!I13+'4. ECG-Matrix'!I15+'4. ECG-Matrix'!I17","v":{"v":244.444444444444,"d":"244"}},{"$f":"C19/E19","v":{"v":0.209090909090909,"d":"21 %"}},{"$f":"IF(F19<0,0,F19)","v":{"v":0.209090909090909,"d":"21 %"}}]
[null,{"$f":"'12.lan'!D218","v":"Environmental sustainability"},{"$f":"'4. ECG-Matrix'!K9+'4. ECG-Matrix'!K11+'4. ECG-Matrix'!K13+'4. ECG-Matrix'!K15+'4. ECG-Matrix'!K17","v":50},{"$f":"'12.lan'!$D$214","v":"of"},{"$f":"'4. ECG-Matrix'!M9+'4. ECG-Matrix'!M11+'4. ECG-Matrix'!M13+'4. ECG-Matrix'!M15+'4. ECG-Matrix'!M17","v":{"v":255.555555555556,"d":"256"}},{"$f":"C20/E20","v":{"v":0.195652173913043,"d":"20 %"}},{"$f":"IF(F20<0,0,F20)","v":{"v":0.195652173913043,"d":"20 %"}}]
[null,{"$f":"'12.lan'!D219","v":"Transparency & co-determination"},{"$f":"'4. ECG-Matrix'!O9+'4. ECG-Matrix'!O11+'4. ECG-Matrix'!O13+'4. ECG-Matrix'!O15+'4. ECG-Matrix'!O17","v":{"v":73.3333333333333,"d":"73"}},{"$f":"'12.lan'!$D$214","v":"of"},{"$f":"'4. ECG-Matrix'!Q9+'4. ECG-Matrix'!Q11+'4. ECG-Matrix'!Q13+'4. ECG-Matrix'!Q15+'4. ECG-Matrix'!Q17","v":{"v":244.444444444444,"d":"244"}},{"$f":"C21/E21","v":{"v":0.3,"d":"30 %"}},{"$f":"IF(F21<0,0,F21)","v":{"v":0.3,"d":"30 %"}}]
[null,{"$f":"'12.lan'!D228","v":"TOTAL"},{"$f":"'3. Calc'!I4","v":{"v":223.333333333333,"d":"223"}},{"$f":"'12.lan'!$D$214","v":"of"},{"$f":"'3. Calc'!J4","v":1000},{"$f":"C22/E22","v":{"v":0.223333333333333,"d":"22 %"}}]

{"sheet":"6. Stakeholder","index":7,"n_rows":23,"n_cols":7,"rows_kept":23,"merged":[[1,1,1,5],[2,1,3,5],[14,1,14,5],[15,1,15,5],[16,1,16,5]]}
[]
[null,{"$f":"'12.lan'!D91&\" - \"&'0. Intro'!B3&\" \"&'0. Intro'!C3","v":"Common Good Balance Calculator - Version 5.04"}]
[null,{"$f":"'12.lan'!D242&'1. General'!C6","v":"Group star for company"}]
{"$rows_empty":13}
[null,{"$f":"'12.lan'!D221","v":"BALANCE OVERVIEW"}]
[null,{"$f":"'12.lan'!D108","v":"Suppliers"},{"$f":"'3. Calc'!I9","v":40},{"$f":"'12.lan'!$D$214","v":"of"},{"$f":"'3. Calc'!J9","v":{"v":177.777777777778,"d":"178"}},{"$f":"C18/E18","v":{"v":0.225,"d":"23 %"}},{"$f":"IF(F18<0,0,F18)","v":{"v":0.225,"d":"23 %"}}]
[null,{"$f":"'12.lan'!D122","v":"Owners, equity- and financial service providers"},{"$f":"'3. Calc'!I23","v":{"v":41.1111111111111,"d":"41"}},{"$f":"'12.lan'!$D$214","v":"of"},{"$f":"'3. Calc'!J23","v":{"v":111.111111111111,"d":"111"}},{"$f":"C19/E19","v":{"v":0.37,"d":"37 %"}},{"$f":"IF(F19<0,0,F19)","v":{"v":0.37,"d":"37 %"}}]
[null,{"$f":"'12.lan'!D137","v":"Employees"},{"$f":"'3. Calc'!I38","v":{"v":71.1111111111111,"d":"71"}},{"$f":"'12.lan'!$D$214","v":"of"},{"$f":"'3. Calc'!J38","v":{"v":355.555555555556,"d":"356"}},{"$f":"C20/E20","v":{"v":0.2,"d":"20 %"}},{"$f":"IF(F20<0,0,F20)","v":{"v":0.2,"d":"20 %"}}]
[null,{"$f":"'12.lan'!D158","v":"Customers and other companies"},{"$f":"'3. Calc'!I59","v":{"v":17.7777777777778,"d":"18"}},{"$f":"'12.lan'!$D$214","v":"of"},{"$f":"'3. Calc'!J59","v":{"v":177.777777777778,"d":"178"}},{"$f":"C21/E21","v":{"v":0.1,"d":"10 %"}},{"$f":"IF(F21<0,0,F21)","v":{"v":0.1,"d":"10 %"}}]
[null,{"$f":"'12.lan'!D175","v":"Social environment"},{"$f":"'3. Calc'!I76","v":{"v":53.3333333333333,"d":"53"}},{"$f":"'12.lan'!$D$214","v":"of"},{"$f":"'3. Calc'!J76","v":{"v":177.777777777778,"d":"178"}},{"$f":"C22/E22","v":{"v":0.3,"d":"30 %"}},{"$f":"IF(F22<0,0,F22)","v":{"v":0.3,"d":"30 %"}}]
[null,{"$f":"'12.lan'!D228","v":"TOTAL"},{"$f":"'3. Calc'!I4","v":{"v":223.333333333333,"d":"223"}},{"$f":"'12.lan'!$D$214","v":"of"},{"$f":"'3. Calc'!J4","v":1000},{"$f":"C23/E23","v":{"v":0.223333333333333,"d":"22 %"}}]

{"sheet":"7. Topics","index":8,"n_rows":38,"n_cols":7,"rows_kept":38,"merged":[[1,1,1,5],[2,1,3,5],[14,1,14,5],[15,1,15,5],[16,1,16,5]]}
[]
[null,{"$f":"'12.lan'!D91&\" - \"&'0. Intro'!B3&\" \"&'0. Intro'!C3","v":"Common Good Balance Calculator - Version 5.04"}]
[null,{"$f":"'12.lan'!D243&'1. General'!C6","v":"Theme star for company"}]
{"$rows_empty":13}
[null,{"$f":"'12.lan'!D221","v":"BALANCE OVERVIEW"}]
[null,"A1",{"$f":"'4. ECG-Matrix'!C9","v":{"v":4.44444444444444,"d":"4"}},{"$f":"'12.lan'!$D$214","v":"of"},{"$f":"'4. ECG-Matrix'!E9","v":{"v":44.4444444444444,"d":"44"}},{"$f":"C18/E18","v":{"v":0.1,"d":"10 %"}},{"$f":"IF(F18<0,0,F18)","v":{"v":0.1,"d":"10 %"}}]
[null,"A2",{"$f":"'4. ECG-Matrix'!G9","v":{"v":4.44444444444444,"d":"4"}},{"$f":"'12.lan'!$D$214","v":"of"},{"$f":"'4. ECG-Matrix'!I9","v":{"v":44.4444444444444,"d":"44"}},{"$f":"C19/E19","v":{"v":0.1,"d":"10 %"}},{"$f":"IF(F19<0,0,F19)","v":{"v":0.1,"d":"10 %"}}]
[null,"A3",{"$f":"'4. ECG-Matrix'!K9","v":{"v":4.44444444444444,"d":"4"}},{"$f":"'12.lan'!$D$214","v":"of"},{"$f":"'4. ECG-Matrix'!M9","v":{"v":44.4444444444444,"d":"44"}},{"$f":"C20/E20","v":{"v":0.1,"d":"10 %"}},{"$f":"IF(F20<0,0,F20)","v":{"v":0.1,"d":"10 %"}}]
[null,"A4",{"$f":"'4. ECG-Matrix'!O9","v":{"v":26.6666666666667,"d":"27"}},{"$f":"'12.lan'!$D$214","v":"of"},{"$f":"'4. ECG-Matrix'!Q9","v":{"v":44.4444444444444,"d":"44"}},{"$f":"C21/E21","v":{"v":0.6,"d":"60 %"}},{"$f":"IF(F21<0,0,F21)","v":{"v":0.6,"d":"60 %"}}]
[null,"B1",{"$f":"'4. ECG-Matrix'!C11","v":{"v":26.6666666666667,"d":"27"}},{"$f":"'12.lan'!$D$214","v":"of"},{"$f":"'4. ECG-Matrix'!E11","v":{"v":33.3333333333333,"d":"33"}},{"$f":"C22/E22","v":{"v":0.8,"d":"80 %"}},{"$f":"IF(F22<0,0,F22)","v":{"v":0.8,"d":"80 %"}}]
[null,"B2",{"$f":"'4. ECG-Matrix'!G11","v":{"v":2.22222222222222,"d":"2"}},{"$f":"'12.lan'!$D$214","v":"of"},{"$f":"'4. ECG-Matrix'!I11","v":{"v":22.2222222222222,"d":"22"}},{"$f":"C23/E23","v":{"v":0.1,"d":"10 %"}},{"$f":"IF(F23<0,0,F23)","v":{"v":0.1,"d":"10 %"}}]
[null,"B3",{"$f":"'4. ECG-Matrix'!K11","v":10},{"$f":"'12.lan'!$D$214","v":"of"},{"$f":"'4. ECG-Matrix'!M11","v":{"v":33.3333333333333,"d":"33"}},{"$f":"C24/E24","v":{"v":0.3,"d":"30 %"}},{"$f":"IF(F24<0,0,F24)","v":{"v":0.3,"d":"30 %"}}]
[null,"B4",{"$f":"'4. ECG-Matrix'!O11","v":{"v":2.22222222222222,"d":"2"}},{"$f":"'12.lan'!$D$214","v":"of"},{"$f":"'4. ECG-Matrix'!Q11","v":{"v":22.2222222222222,"d":"22"}},{"$f":"C25/E25","v":{"v":0.1,"d":"10 %"}},{"$f":"IF(F25<0,0,F25)","v":{"v":0.1,"d":"10 %"}}]
[null,"C1",{"$f":"'4. ECG-Matrix'!C13","v":{"v":17.7777777777778,"d":"18"}},{"$f":"'12.lan'!$D$214","v":"of"},{"$f":"'4. ECG-Matrix'!E13","v":{"v":88.8888888888889,"d":"89"}},{"$f":"C26/E26","v":{"v":0.2,"d":"20 %"}},{"$f":"IF(F26<0,0,F26)","v":{"v":0.2,"d":"20 %"}}]
[null,"C2",{"$f":"'4. ECG-Matrix'!G13","v":{"v":17.7777777777778,"d":"18"}},{"$f":"'12.lan'!$D$214","v":"of"},{"$f":"'4. ECG-Matrix'!I13","v":{"v":88.8888888888889,"d":"89"}},{"$f":"C27/E27","v":{"v":0.2,"d":"20 %"}},{"$f":"IF(F27<0,0,F27)","v":{"v":0.2,"d":"20 %"}}]
[null,"C3",{"$f":"'4. ECG-Matrix'!K13","v":{"v":17.7777777777778,"d":"18"}},{"$f":"'12.lan'!$D$214","v":"of"},{"$f":"'4. ECG-Matrix'!M13","v":{"v":88.8888888888889,"d":"89"}},{"$f":"C28/E28","v":{"v":0.2,"d":"20 %"}},{"$f":"IF(F28<0,0,F28)","v":{"v":0.2,"d":"20 %"}}]
[null,"C4",{"$f":"'4. ECG-Matrix'!O13","v":{"v":17.7777777777778,"d":"18"}},{"$f":"'12.lan'!$D$214","v":"of"},{"$f":"'4. ECG-Matrix'!Q13","v":{"v":88.8888888888889,"d":"89"}},{"$f":"C29/E29","v":{"v":0.2,"d":"20 %"}},{"$f":"IF(F29<0,0,F29)","v":{"v":0.2,"d":"20 %"}}]
[null,"D1",{"$f":"'4. ECG-Matrix'!C15","v":0},{"$f":"'12.lan'!$D$214","v":"of"},{"$f":"'4. ECG-Matrix'!E15","v":{"v":44.4444444444444,"d":"44"}},{"$f":"C30/E30","v":{"v":0,"d":"0 %"}},{"$f":"IF(F30<0,0,F30)","v":{"v":0,"d":"0 %"}}]
[null,"D2",{"$f":"'4. ECG-Matrix'!G15","v":{"v":17.7777777777778,"d":"18"}},{"$f":"'12.lan'!$D$214","v":"of"},{"$f":"'4. ECG-Matrix'!I15","v":{"v":44.4444444444444,"d":"44"}},{"$f":"C31/E31","v":{"v":0.4,"d":"40 %"}},{"$f":"IF(F31<0,0,F31)","v":{"v":0.4,"d":"40 %"}}]
[null,"D3",{"$f":"'4. ECG-Matrix'!K15","v":0},{"$f":"'12.lan'!$D$214","v":"of"},{"$f":"'4. ECG-Matrix'!M15","v":{"v":44.4444444444444,"d":"44"}},{"$f":"C32/E32","v":{"v":0,"d":"0 %"}},{"$f":"IF(F32<0,0,F32)","v":{"v":0,"d":"0 %"}}]
[null,"D4",{"$f":"'4. ECG-Matrix'!O15","v":0},{"$f":"'12.lan'!$D$214","v":"of"},{"$f":"'4. ECG-Matrix'!Q15","v":{"v":44.4444444444444,"d":"44"}},{"$f":"C33/E33","v":{"v":0,"d":"0 %"}},{"$f":"IF(F33<0,0,F33)","v":{"v":0,"d":"0 %"}}]
[null,"E1",{"$f":"'4. ECG-Matrix'!C17","v":0},{"$f":"'12.lan'!$D$214","v":"of"},{"$f":"'4. ECG-Matrix'!E17","v":{"v":44.4444444444444,"d":"44"}},{"$f":"C34/E34","v":{"v":0,"d":"0 %"}},{"$f":"IF(F34<0,0,F34)","v":{"v":0,"d":"0 %"}}]
[null,"E2",{"$f":"'4. ECG-Matrix'!G17","v":{"v":8.88888888888889,"d":"9"}},{"$f":"'12.lan'!$D$214","v":"of"},{"$f":"'4. ECG-Matrix'!I17","v":{"v":44.4444444444444,"d":"44"}},{"$f":"C35/E35","v":{"v":0.2,"d":"20 %"}},{"$f":"IF(F35<0,0,F35)","v":{"v":0.2,"d":"20 %"}}]
[null,"E3",{"$f":"'4. ECG-Matrix'!K17","v":{"v":17.7777777777778,"d":"18"}},{"$f":"'12.lan'!$D$214","v":"of"},{"$f":"'4. ECG-Matrix'!M17","v":{"v":44.4444444444444,"d":"44"}},{"$f":"C36/E36","v":{"v":0.4,"d":"40 %"}},{"$f":"IF(F36<0,0,F36)","v":{"v":0.4,"d":"40 %"}}]
[null,"E4",{"$f":"'4. ECG-Matrix'!O17","v":{"v":26.6666666666667,"d":"27"}},{"$f":"'12.lan'!$D$214","v":"of"},{"$f":"'4. ECG-Matrix'!Q17","v":{"v":44.4444444444444,"d":"44"}},{"$f":"C37/E37","v":{"v":0.6,"d":"60 %"}},{"$f":"IF(F37<0,0,F37)","v":{"v":0.6,"d":"60 %"}}]
[null,{"$f":"'12.lan'!D228","v":"TOTAL"},{"$f":"'3. Calc'!I4","v":{"v":223.333333333333,"d":"223"}},{"$f":"'12.lan'!$D$214","v":"of"},{"$f":"'3. Calc'!J4","v":1000},{"$f":"C38/E38","v":{"v":0.223333333333333,"d":"22 %"}}]

{"sheet":"8. Descr.Weighting","index":9,"n_rows":26,"n_cols":3,"rows_kept":26,"merged":[[1,0,1,2]]}
[{"$f":"'12.lan'!D91&\" - \"&'0. Intro'!B3&\" \"&'0. Intro'!C3","v":"Common Good Balance Calculator - Version 5.04"}]
[{"$f":"'12.lan'!D204","v":"Description of the weighting model"}]
[]
[{"$f":"'12.lan'!D208","v":"General"},null,{"$f":"'12.lan'!D244","v":"The allocation of equal and fixed scores for all companies has been the subject of much discussion within the Matrix-development team during the past few years. Outside sources have also raised many questions and provided feedback. Untill now, the way points are distributed for themes has been the same for all companies (with the exception of one-person companies), regardless of company size, industry and other parameters (regional background, B2B versus B2C, etc.). However, these variables may well have an effect on the relevance to and effect on the common good.For example, the supply chain of an electronics trading company (A1-A4) is more significant than for a mining company, which, in turn, leaves a huge, direct environmental impact, amongst other things (E3). The new weighting model addresses these issues and highlights the significant factors. A survey on the changes was conducted, with feedback clearly favouring a new approach."}]
[{"$f":"'12.lan'!D207","v":"Stakekolders & values"},null,{"$f":"'12.lan'!D245","v":"For the weighting of three stakeholder groups, A) suppliers, B) investors and C) employees, the matrix takes into account the following financial flows to these stakeholders: A) procurement expenditure, B) profit and borrowing costs C) wages and salaries. We are aware of the limited significance attached to money in the current matrix and have plans for how this can be improved in the future. At the same time, this information is readily available in companies' financial balance sheets, and easily meets the needs of many companies. Since taxes and borrowing costs are included in procurement expenditure, these account for only 50% of the weighting."}]
[{"$f":"'12.lan'!D205","v":"Themes"},null,{"$f":"'12.lan'!D246","v":"There are also criteria for the weighting of the themes, for example a company's size or industry or the relevant local employment law. The United Nations' International Standard Industrial Classification of All Economic Activities (ISIC Rev.4) is used for all industry sector definitions. For size classification, definitions as set out by the EU are used. The table below summarises the current weighting factors (as at May 2017):"}]
["A1",null,"-"]
["A2",null,{"$f":"'12.lan'!D248","v":"-"}]
["A3",null,{"$f":"'12.lan'!D249","v":"The weighting of this theme is dependent on the environmental effect of the supplier's sector (see sheet “Industry\")."}]
["A4",null,{"$f":"'12.lan'!D250","v":"The weighting of this theme is dependent on co-determination rights in the countries of the most important supply industries (based on the ILUC index of the International Labour Union)."}]
["B1",null,{"$f":"'12.lan'!D251","v":"The weighting of this theme depends on the ratio turnover to the balance sheet total."}]
["B2",null,{"$f":"'12.lan'!D252","v":"The weighting of this theme depends on the ratio profit to turnover"}]
["B3",null,{"$f":"'12.lan'!D253","v":"The weighting of this theme is dependent on additions to fixed-assets and financial assets in relation to the balance sheet total."}]
["B4",null,{"$f":"'12.lan'!D254","v":"The weighting of this theme is dependent on the size of the company."}]
["C1",null,{"$f":"'12.lan'!D255","v":"-"}]
["C2",null,{"$f":"'12.lan'!D256","v":"-"}]
["C3",null,{"$f":"'12.lan'!D257","v":"The weighting of this theme is dependent on the existence of a canteen for most of the employees as well as an (estimated) average commute to work."}]
["C4",null,{"$f":"'12.lan'!D258","v":"The weighting of this theme is dependent on company size and co-determination rights in the countries of the most important supply industries (based on the ILUC index of the International Labour Union)."}]
["D1",null,{"$f":"'12.lan'!D259","v":"-"}]
["D2",null,{"$f":"'12.lan'!D260","v":"-"}]
["D3",null,{"$f":"'12.lan'!D261","v":"The weighting of this theme depends on the industry sector."}]
["D4",null,{"$f":"'12.lan'!D262","v":"The weighting of this theme depends on whether customers are primarily individuals or companies."}]
["E1",null,{"$f":"'12.lan'!D263","v":"-"}]
["E2",null,{"$f":"'12.lan'!D264","v":"The weighting of this theme is dependent on the return on sales (profit/turnover)."}]
["E3",null,{"$f":"'12.lan'!D265","v":"The weighting of this theme depends on the industry sector."}]
["E4",null,{"$f":"'12.lan'!D266","v":"The weighting of this theme depends on the company size and the industry sector."}]

{"sheet":"10. Industry","index":10,"n_rows":39,"n_cols":17,"rows_kept":39,"hidden":true,"merged":[[0,0,0,16],[1,2,1,3],[1,4,1,5],[1,6,1,7],[1,8,1,9],[1,10,1,11],[1,12,1,13],[1,14,1,16],[1,17,1,18]]}
["INDUSTRY WEIGHTING - COMMON GOOD MATRIX"]
[null,"INDUSTRY ",null,null,"A1 -social risks in the Supply Chain",null,"A3 -ecological sustainability in the Supply Chain",null,"D3 - Ecological Design of products and services",null,"E3 -  Reduction of Environmental Impact",null,"E4 - Social transparency and co-\ndetermination",null,"A3 - Ecologicla Supply Chain Risk"]
[null,"(based UN International Standard Industrial Classification of All Economic Activities, Rev.4 -http://unstats.un.org/unsd/cr/registry/regcst.asp?Cl=27)",null,null,"weighting","argumentation: based on the social risks in the industry","weighting","argumentation: based on ecological impact on the planterary boundaries in the supply cahin (studies and the use of quantitative models - e.g. ecological footprint - will be applied herefor)","weighting","argumentation: based on the products / service impact on the planterary boundaries in the use phase (studies and the use of quantitative models - e.g. ecological footprint - will be applied herefor)","weighting","argumentation: based on the sectors direct impact in the production phase on the planterary boundaries (studies and the use of quantitative models will be applied herefor); e.g. sehr hoch: The sector has a major impact of various planetary boundaries","weighting","argumentation: the weighting is depending on the impact the industry has particularly on the adjacent environment\n",null,"weighting","argumentation: based on the sectors direct impact in the production phase on the planterary boundaries (studies and the use of quantitative models will be applied herefor)\nsehr hoch: The sector has a major impact of various planetary boundaries"]
["A ",{"$f":"'12.lan'!D268","v":"A - agriculture, forestry management, fishing industry"},null,null,"sehr hoch",null,null,"ist E3?","mittel","the main impacts are in the production phase","sehr hoch","major direct impact on various planetary boundaries in the production (climate change, N/P-cycle, biodiversity, land-use-change) ","mittel",null,null,"sehr hoch"]
["B ",{"$f":"'12.lan'!D269","v":"B - Mining and quarrying"},null,null,"sehr hoch",{"$nulls":3},"mittel",null,"sehr hoch","major impact on eco-systems","sehr hoch",null,null,"sehr hoch"]
["C ",{"$f":"'12.lan'!D270","v":"C - Manufacturing industries (not further specified)"},null,null,"hoch",{"$nulls":3},"mittel",null,"hoch","Please note: This industry is very heterogen. ","hoch",null,null,"hoch"]
["Ca",{"$f":"'12.lan'!D271","v":"Ca - Food production, drinks and tobacco (C10, C11, C12)"},null,null,"sehr hoch",{"$nulls":3},"mittel",null,"mittel",null,"mittel",null,null,"sehr hoch"]
["Cb",{"$f":"'12.lan'!D272","v":"Cb - Textile production, clothing, leather and leather products (C13, C14, C15)"},null,null,"sehr hoch",{"$nulls":3},"mittel",null,"hoch",null,"mittel",null,null,"sehr hoch"]
["Cc",{"$f":"'12.lan'!D273","v":"Cc - Paper and forest products, also printed matter (C16, C17, C18)"},null,null,"hoch",{"$nulls":3},"mittel",null,"hoch",null,"mittel",null,null,"sehr hoch"]
["Cd",{"$f":"'12.lan'!D274","v":"Cd - Production of petrochemical products and plastics (C19, C20;C22)"},null,null,"sehr hoch",{"$nulls":3},"mittel",null,"hoch",null,"hoch",null,null,"sehr hoch"]
["Ce",{"$f":"'12.lan'!D275","v":"Ce - Pharmaceutical products and preparations (C21)"},null,null,"mittel",{"$nulls":3},"hoch","residues for some pharmaproducts critical","hoch",null,"hoch",null,null,"hoch"]
["Cf",{"$f":"'12.lan'!D276","v":"Cf - Production of non-metallic minerals (C23)"},null,null,"hoch",{"$nulls":3},"mittel",null,"hoch",null,"hoch",null,null,"hoch"]
["Cg",{"$f":"'12.lan'!D277","v":"Cg - Production of metal and metallic products (excl. machines and equipment) (C24, C25)"},null,null,"sehr hoch",{"$nulls":3},"mittel",null,"hoch",null,"hoch",null,null,"sehr hoch"]
["Ch",{"$f":"'12.lan'!D278","v":"Ch - Production of electronic equipment, instruments and components as well as computers (C26, C27, C28)"},null,null,"sehr hoch",{"$nulls":3},"hoch",null,"hoch",null,"hoch",null,null,"sehr hoch"]
["D ",{"$f":"'12.lan'!D279","v":"D - Electric, Gas, Steam and Refrigeration"},null,null,"mittel",{"$nulls":3},"mittel",null,"sehr hoch","major impact on climate change","hoch",null,null,"sehr hoch"]
["E ",{"$f":"'12.lan'!D280","v":"E - Water supply, waste management"},null,null,"mittel",{"$nulls":3},"hoch",null,"hoch",null,"hoch",null,null,"mittel"]
["F ",{"$f":"'12.lan'!D281","v":"F - Construction industry"},null,null,"sehr hoch",{"$nulls":3},"sehr hoch",null,"sehr hoch","major impact on climate change (see d3) and impacting land-use-change","sehr hoch",null,null,"sehr hoch"]
["G ",{"$f":"'12.lan'!D282","v":"G - Wholesale and retail"},null,null,"mittel",{"$nulls":3},"sehr hoch",null,"mittel",null,"mittel",null,null,"hoch"]
["H ",{"$f":"'12.lan'!D283","v":"H - Transport and warehousing"},null,null,"mittel",{"$nulls":3},"mittel",null,"sehr hoch",null,"mittel",null,null,"hoch"]
["I ",{"$f":"'12.lan'!D284","v":"I - Accommodation and catering"},null,null,"hoch",{"$nulls":3},"mittel",null,"hoch",null,"mittel",null,null,"hoch"]
["J ",{"$f":"'12.lan'!D285","v":"J - Information and Communication"},null,null,"mittel",{"$nulls":3},"mittel",null,"hoch",null,"mittel",null,null,"hoch"]
["K ",{"$f":"'12.lan'!D286","v":"K - Financial services"},null,null,"mittel",{"$nulls":3},"sehr hoch",null,"mittel",null,"mittel",null,null,"mittel"]
["L ",{"$f":"'12.lan'!D287","v":"L - Real estate"},null,null,"mittel",{"$nulls":3},"sehr hoch",null,"mittel",null,"mittel",null,null,"hoch"]
["M ",{"$f":"'12.lan'!D288","v":"M - Professional, technical and scientific services"},null,null,"mittel",{"$nulls":3},"mittel",null,"mittel",null,"mittel",null,null,"mittel"]
["N ",{"$f":"'12.lan'!D289","v":"N - Administrative and support services"},null,null,"mittel",{"$nulls":3},"mittel",null,"mittel",null,"mittel",null,null,"mittel"]
["O ",{"$f":"'12.lan'!D290","v":"O - Public administration; defence; social security"},null,null,"mittel",{"$nulls":3},"mittel",null,"mittel",null,"mittel",null,null,"mittel"]
["P ",{"$f":"'12.lan'!D291","v":"P - Education"},null,null,"mittel",{"$nulls":3},"mittel",null,"mittel",null,"mittel",null,null,"mittel"]
["Q ",{"$f":"'12.lan'!D292","v":"Q - Health and social work"},null,null,"mittel",{"$nulls":3},"mittel",null,"mittel",null,"mittel",null,null,"mittel"]
["R ",{"$f":"'12.lan'!D293","v":"R - Art, education and leisure"},null,null,"mittel",{"$nulls":3},"mittel",null,"mittel",null,"mittel",null,null,"mittel"]
["S ",{"$f":"'12.lan'!D294","v":"S - Other services"},null,null,"mittel",{"$nulls":3},"mittel",null,"mittel",null,"mittel",null,null,"mittel"]
["T",{"$f":"'12.lan'!D295","v":"Please enter"},null,null,"mittel",{"$nulls":3},"mittel",null,"mittel",null,"mittel",null,null,"mittel"]
["U ",{"$f":"'12.lan'!D296","v":"U - Extraterritorial organisations and bodies"},null,null,"mittel",{"$nulls":3},"mittel",null,"mittel",null,"mittel",null,null,"mittel"]
[]
[{"$f":"'9. Weighting'!H35","v":"Pl"},"Branche 1",{"$f":"'9. Weighting'!I35","v":{"v":0,"d":"0 %"}},{"$nulls":5},{"$f":"IFERROR(VLOOKUP(A34,'10. Industry'!$A$4:$O$32,9,FALSE()),\"mittel\")","v":"mittel"},{"$f":"VLOOKUP(I34,'9. Weighting'!$F$49:$H$53,3,FALSE())","v":{"v":1,"d":"1.00"}},{"$f":"IFERROR(VLOOKUP(A34,'10. Industry'!$A$4:$O$32,11,FALSE()),\"mittel\")","v":"mittel"},{"$f":"VLOOKUP(K34,'9. Weighting'!$F$49:$H$53,3,FALSE())","v":{"v":1,"d":"1.00"}}]
[{"$f":"'9. Weighting'!H36","v":"Pl"},"Branche 2",{"$f":"'9. Weighting'!I36","v":{"v":0,"d":"0 %"}},{"$nulls":5},{"$f":"IFERROR(VLOOKUP(A35,'10. Industry'!$A$4:$O$32,9,FALSE()),\"mittel\")","v":"mittel"},{"$f":"VLOOKUP(I35,'9. Weighting'!$F$49:$H$53,3,FALSE())","v":{"v":1,"d":"1.00"}},{"$f":"IFERROR(VLOOKUP(A35,'10. Industry'!$A$4:$O$32,11,FALSE()),\"mittel\")","v":"mittel"},{"$f":"VLOOKUP(K35,'9. Weighting'!$F$49:$H$53,3,FALSE())","v":{"v":1,"d":"1.00"}}]
[{"$f":"'9. Weighting'!H37","v":"Pl"},"Branche 3",{"$f":"'9. Weighting'!I37","v":{"v":0,"d":"0 %"}},{"$nulls":5},{"$f":"IFERROR(VLOOKUP(A36,'10. Industry'!$A$4:$O$32,9,FALSE()),\"mittel\")","v":"mittel"},{"$f":"VLOOKUP(I36,'9. Weighting'!$F$49:$H$53,3,FALSE())","v":{"v":1,"d":"1.00"}},{"$f":"IFERROR(VLOOKUP(A36,'10. Industry'!$A$4:$O$32,11,FALSE()),\"mittel\")","v":"mittel"},{"$f":"VLOOKUP(K36,'9. Weighting'!$F$49:$H$53,3,FALSE())","v":{"v":1,"d":"1.00"}}]
[null,null,{"$f":"1-SUM(C34:C36)","v":{"v":1,"d":"100 %"}},{"$nulls":5},"mittel",{"$f":"VLOOKUP(I37,'9. Weighting'!$F$49:$H$53,3,FALSE())","v":{"v":1,"d":"1.00"}},"mittel",{"$f":"VLOOKUP(K37,'9. Weighting'!$F$49:$H$53,3,FALSE())","v":{"v":1,"d":"1.00"}}]
[null,null,{"$f":"SUM(C34:C37)","v":{"v":1,"d":"100 %"}},{"$nulls":6},{"$f":"C34*J34+C35*J35+C36*J36+C37*J37","v":{"v":1,"d":"1.00"}},null,{"$f":"C34*L34+C35*L35+C36*L36+C37*L37","v":{"v":1,"d":"1.00"}}]
[null,"ÖKOLOGISCHE BRANCHENGEWICHTUNGEN",{"$nulls":7},{"$f":"IF(J38<0.75,\"niedrig\",IF(J38<1.25,\"mittel\",IF(J38>1.75,\"sehr hoch\",\"hoch\")))","v":"mittel"},null,{"$f":"IF(L38<0.75,\"niedrig\",IF(L38<1.25,\"mittel\",IF(L38>1.75,\"sehr hoch\",\"hoch\")))","v":"mittel"}]

{"sheet":"11.Region","index":11,"n_rows":243,"n_cols":17,"rows_kept":243,"hidden":true,"merged":[[0,0,0,6],[1,11,1,13],[1,14,1,16],[2,1,7,1],[2,6,7,6],[7,9,7,12]]}
["SUPPLIERS AND EMPLOYEE WEIGHTING RATIO"]
[null,"added value of suppliers (source: income statement)","Splitted added value (source¿?)","Country","PPP index (source¿?)","Added value adjusted","Total","%","ITUC (average)","Industry","nace","ecol. Impact (A3)",null,null,"social impact (A1)"]
["Supplier 1",{"$f":"'9. Weighting'!I10","v":{"v":10000,"d":"10,000"}},{"$f":"'9. Weighting'!I13","v":500},{"$f":"'9. Weighting'!H13","v":"Please choose"},{"$f":"IFERROR(VLOOKUP(D3,$A$22:$G$400,3,FALSE()),$C$243)","v":{"v":0.978035862587365,"d":"0.98"}},{"$f":"IFERROR(C3*E3,\"0\")","v":{"v":489.017931293682,"d":"489"}},{"$f":"SUM(F3:F8)","v":{"v":9780.35862587365,"d":"9,780"}},{"$f":"IFERROR(F3/$G$3,\"-\")","v":{"v":0.05,"d":"5 %"}},{"$f":"IFERROR(VLOOKUP(D3,$A$21:$I$134,6,FALSE()),2.99)","v":2.99},{"$f":"'9. Weighting'!E13","v":"Pl"},{"$f":"'9. Weighting'!G13","v":"Please enter"},{"$f":"IFERROR(VLOOKUP(J3,'10. Industry'!$A$4:$P$32,16,FALSE()),'3. Calc'!C104)","v":1},{"$f":"VLOOKUP(L3,'9. Weighting'!$F$49:$H$53,3,FALSE())","v":{"$error":"#N/A"}},{"$f":"M3*H3","v":{"$error":"#N/A"}},{"$f":"IFERROR(VLOOKUP(J3,'10. Industry'!$A$4:$N$32,5,FALSE()),'3. Calc'!C104)","v":1},{"$f":"VLOOKUP(O3,'9. Weighting'!$F$49:$H$53,3,FALSE())","v":{"$error":"#N/A"}},{"$f":"P3*H3","v":{"$error":"#N/A"}}]
["Supplier 2",null,{"$f":"'9. Weighting'!I14","v":0},{"$f":"'9. Weighting'!H14","v":"Please choose"},{"$f":"IFERROR(VLOOKUP(D4,$A$22:$G$400,3,FALSE()),$C$243)","v":{"v":0.978035862587365,"d":"0.98"}},{"$f":"IFERROR(C4*E4,\"0\")","v":0},null,{"$f":"IFERROR(F4/$G$3,\"-\")","v":{"v":0,"d":"0 %"}},{"$f":"IFERROR(VLOOKUP(D4,$A$21:$I$134,6,FALSE()),2.99)","v":2.99},{"$f":"'9. Weighting'!E14","v":"Pl"},{"$f":"'9. Weighting'!G14","v":"Please enter"},{"$f":"IFERROR(VLOOKUP(J4,'10. Industry'!$A$4:$P$32,16,FALSE()),'3. Calc'!C104)","v":1},{"$f":"VLOOKUP(L4,'9. Weighting'!$F$49:$H$53,3,FALSE())","v":{"$error":"#N/A"}},{"$f":"M4*H4","v":{"$error":"#N/A"}},{"$f":"IFERROR(VLOOKUP(J4,'10. Industry'!$A$4:$N$32,5,FALSE()),'3. Calc'!C104)","v":1},{"$f":"VLOOKUP(O4,'9. Weighting'!$F$49:$H$53,3,FALSE())","v":{"$error":"#N/A"}},{"$f":"P4*H4","v":{"$error":"#N/A"}}]
["Supplier 3",null,{"$f":"'9. Weighting'!I15","v":0},{"$f":"'9. Weighting'!H15","v":"Please choose"},{"$f":"IFERROR(VLOOKUP(D5,$A$22:$G$400,3,FALSE()),$C$243)","v":{"v":0.978035862587365,"d":"0.98"}},{"$f":"IFERROR(C5*E5,\"0\")","v":0},null,{"$f":"IFERROR(F5/$G$3,\"-\")","v":{"v":0,"d":"0 %"}},{"$f":"IFERROR(VLOOKUP(D5,$A$21:$I$134,6,FALSE()),2.99)","v":2.99},{"$f":"'9. Weighting'!E15","v":"Pl"},{"$f":"'9. Weighting'!G15","v":"Please enter"},{"$f":"IFERROR(VLOOKUP(J5,'10. Industry'!$A$4:$P$32,16,FALSE()),'3. Calc'!C104)","v":1},{"$f":"VLOOKUP(L5,'9. Weighting'!$F$49:$H$53,3,FALSE())","v":{"$error":"#N/A"}},{"$f":"M5*H5","v":{"$error":"#N/A"}},{"$f":"IFERROR(VLOOKUP(J5,'10. Industry'!$A$4:$N$32,5,FALSE()),'3. Calc'!C104)","v":1},{"$f":"VLOOKUP(O5,'9. Weighting'!$F$49:$H$53,3,FALSE())","v":{"$error":"#N/A"}},{"$f":"P5*H5","v":{"$error":"#N/A"}}]
["Supplier 4",null,{"$f":"'9. Weighting'!I16","v":0},{"$f":"'9. Weighting'!H16","v":"Please choose"},{"$f":"IFERROR(VLOOKUP(D6,$A$22:$G$400,3,FALSE()),$C$243)","v":{"v":0.978035862587365,"d":"0.98"}},{"$f":"IFERROR(C6*E6,\"0\")","v":0},null,{"$f":"IFERROR(F6/$G$3,\"-\")","v":{"v":0,"d":"0 %"}},{"$f":"IFERROR(VLOOKUP(D6,$A$21:$I$134,6,FALSE()),2.99)","v":2.99},{"$f":"'9. Weighting'!E16","v":"Pl"},{"$f":"'9. Weighting'!G16","v":"Please enter"},{"$f":"IFERROR(VLOOKUP(J6,'10. Industry'!$A$4:$P$32,16,FALSE()),'3. Calc'!C104)","v":1},{"$f":"VLOOKUP(L6,'9. Weighting'!$F$49:$H$53,3,FALSE())","v":{"$error":"#N/A"}},{"$f":"M6*H6","v":{"$error":"#N/A"}},{"$f":"IFERROR(VLOOKUP(J6,'10. Industry'!$A$4:$N$32,5,FALSE()),'3. Calc'!C104)","v":1},{"$f":"VLOOKUP(O6,'9. Weighting'!$F$49:$H$53,3,FALSE())","v":{"$error":"#N/A"}},{"$f":"P6*H6","v":{"$error":"#N/A"}}]
["Supplier 5",null,{"$f":"'9. Weighting'!I17","v":0},{"$f":"'9. Weighting'!H17","v":"Please choose"},{"$f":"IFERROR(VLOOKUP(D7,$A$22:$G$400,3,FALSE()),$C$243)","v":{"v":0.978035862587365,"d":"0.98"}},{"$f":"IFERROR(C7*E7,\"0\")","v":0},null,{"$f":"IFERROR(F7/$G$3,\"-\")","v":{"v":0,"d":"0 %"}},{"$f":"IFERROR(VLOOKUP(D7,$A$21:$I$134,6,FALSE()),2.99)","v":2.99},{"$f":"'9. Weighting'!E17","v":"Pl"},{"$f":"'9. Weighting'!G17","v":"Please enter"},{"$f":"IFERROR(VLOOKUP(J7,'10. Industry'!$A$4:$P$32,16,FALSE()),'3. Calc'!C104)","v":1},{"$f":"VLOOKUP(L7,'9. Weighting'!$F$49:$H$53,3,FALSE())","v":{"$error":"#N/A"}},{"$f":"M7*H7","v":{"$error":"#N/A"}},{"$f":"IFERROR(VLOOKUP(J7,'10. Industry'!$A$4:$N$32,5,FALSE()),'3. Calc'!C104)","v":1},{"$f":"VLOOKUP(O7,'9. Weighting'!$F$49:$H$53,3,FALSE())","v":{"$error":"#N/A"}},{"$f":"P7*H7","v":{"$error":"#N/A"}}]
["Rest of suppliers",null,{"$f":"'9. Weighting'!I18","v":{"v":9500,"d":"9,500"}},{"$f":"'9. Weighting'!H18","v":"Please choose"},{"$f":"IFERROR(VLOOKUP(D8,$A$22:$G$400,3,FALSE()),$C$243)","v":{"v":0.978035862587365,"d":"0.98"}},{"$f":"IFERROR(C8*E8,\"0\")","v":{"v":9291.34069457997,"d":"9,291"}},null,{"$f":"IFERROR(F8/$G$3,\"-\")","v":{"v":0.95,"d":"95 %"}},{"$f":"IFERROR(VLOOKUP(D8,$A$21:$I$134,6,FALSE()),2.99)","v":2.99},"Supply Chain Gewichtung",{"$nulls":3},{"$f":"IFERROR((SUM(N3:N7)*1)/SUM(H3:H7),1)","v":1},null,null,{"$f":"IFERROR((SUM(Q3:Q7)*1)/SUM(H3:H7),1)","v":1}]
[{"$nulls":8},{"$f":"IFERROR(I3*H3+I4*H4+I5*H5+I6*H6+I7*H7+I8*H8,I21)","v":2.99}]
["Workers",{"$f":"'9. Weighting'!I25","v":{"v":33333,"d":"33,333"}},{"$f":"'2. Company Facts'!D30","v":{"v":0,"d":"0 %"}},{"$f":"'2. Company Facts'!B30","v":"Please choose"},{"$f":"IFERROR(VLOOKUP(D10,$A$22:$G$400,3,FALSE()),$C$243)","v":{"v":0.978035862587365,"d":"0.98"}},{"$f":"C10*E10*B10","v":0},{"$f":"F10+F11+F12+F13","v":{"v":32600.8694076246,"d":"32,601"}},{"$f":"SUM(H3:H8)","v":{"v":1,"d":"100 %"}},{"$f":"IFERROR(VLOOKUP(D10,$A$21:$I$134,6,FALSE()),I28)","v":0}]
[null,null,{"$f":"'2. Company Facts'!D31","v":{"v":0,"d":"0 %"}},{"$f":"'2. Company Facts'!B31","v":"Please choose"},{"$f":"IFERROR(VLOOKUP(D11,$A$22:$G$400,3,FALSE()),$C$243)","v":{"v":0.978035862587365,"d":"0.98"}},{"$f":"C11*E11*B10","v":0},null,null,{"$f":"IFERROR(VLOOKUP(D11,$A$21:$I$134,6,FALSE()),I29)","v":0}]
[null,null,{"$f":"'2. Company Facts'!D32","v":{"v":0,"d":"0 %"}},{"$f":"'2. Company Facts'!B32","v":"Please choose"},{"$f":"IFERROR(VLOOKUP(D12,$A$22:$G$400,3,FALSE()),$C$243)","v":{"v":0.978035862587365,"d":"0.98"}},{"$f":"C12*E12*B10","v":0},null,null,{"$f":"IFERROR(VLOOKUP(D12,$A$21:$I$134,6,FALSE()),I30)","v":0}]
[null,null,{"$f":"1-C10-C11-C12","v":{"v":1,"d":"100 %"}},{"$f":"A21","v":"Country Code"},{"$f":"IFERROR(VLOOKUP(D13,$A$22:$G$400,3,FALSE()),$C$243)","v":{"v":0.978035862587365,"d":"0.98"}},{"$f":"C13*E13*B10","v":{"v":32600.8694076246,"d":"32,601"}},null,null,{"$f":"IFERROR(VLOOKUP(D13,$A$21:$I$134,9,FALSE()),\"0\")","v":0}]
["Please note that the boxes with a red frame have to be filled out. ",{"$nulls":7},{"$f":"I10*C10+I11*C11+I12*C12+I13*C13","v":0}]
[]
[]
["Purchasing Power Parity Tables"]
["Data Source","Worldbank Data"]
["Last Updated Date","2_2018",null,null,"http://data.worldbank.org/indicator/NY.GDP.MKTP.PP.CD",null,null," "]
[]
["Country Code","Country Name","PPP Factor",null,"Region","ITUC",{"$nulls":3},"code"]
[{"$f":"'12.lan'!D339","v":"ABW Aruba"},"Aruba",{"$f":"VLOOKUP(B22,'12.ppp data'!$C$3:$J$273,7,FALSE())","v":{"v":1.96289944979353,"d":"2.0"}},{"$f":"IF(VLOOKUP(B22,'12.ppp data'!$C$3:$J$273,8,FALSE())=\"est\",\"est\",\"-\")","v":"est"},"Americas",{"v":3.42105263157895,"d":"3.4"},"est",null,null,"ABW"]
[{"$f":"'12.lan'!D340","v":"AFG Afghanistan"},"Afghanistan",{"$f":"VLOOKUP(B23,'12.ppp data'!$C$3:$J$273,7,FALSE())","v":{"v":3.77632641651362,"d":"3.8"}},{"$f":"IF(VLOOKUP(B23,'12.ppp data'!$C$3:$J$273,8,FALSE())=\"est\",\"est\",\"-\")","v":"-"},"Asia",{"v":4.17857142857143,"d":"4.2"},"est",null,null,"AFG"]
[{"$f":"'12.lan'!D341","v":"AGO Angola"},"Angola",{"$f":"VLOOKUP(B24,'12.ppp data'!$C$3:$J$273,7,FALSE())","v":{"v":1.72178179224687,"d":"1.7"}},{"$f":"IF(VLOOKUP(B24,'12.ppp data'!$C$3:$J$273,8,FALSE())=\"est\",\"est\",\"-\")","v":"-"},"Africa",{"v":2,"d":"2.0"},{"$nulls":3},"AGO"]
[{"$f":"'12.lan'!D342","v":"ALB Albania"},"Albania",{"$f":"VLOOKUP(B25,'12.ppp data'!$C$3:$J$273,7,FALSE())","v":{"v":2.95661266669197,"d":"3.0"}},{"$f":"IF(VLOOKUP(B25,'12.ppp data'!$C$3:$J$273,8,FALSE())=\"est\",\"est\",\"-\")","v":"-"},"Europe",{"v":2,"d":"2.0"},{"$nulls":3},"ALB"]
[{"$f":"'12.lan'!D343","v":"AND Andorra"},"Andorra",{"$f":"VLOOKUP(B26,'12.ppp data'!$C$3:$J$273,7,FALSE())","v":{"v":1.93286164519776,"d":"1.9"}},{"$f":"IF(VLOOKUP(B26,'12.ppp data'!$C$3:$J$273,8,FALSE())=\"est\",\"est\",\"-\")","v":"est"},"Europe",{"v":2,"d":"2.0"},"est",null,null,"AND"]
[{"$f":"'12.lan'!D344","v":"ARE United Arab Emirates"},"United Arab Emirates",{"$f":"VLOOKUP(B27,'12.ppp data'!$C$3:$J$273,7,FALSE())","v":{"v":2.05010803135594,"d":"2.1"}},{"$f":"IF(VLOOKUP(B27,'12.ppp data'!$C$3:$J$273,8,FALSE())=\"est\",\"est\",\"-\")","v":"-"},"Asia",{"v":5,"d":"5.0"},{"$nulls":3},"ARE"]
[{"$f":"'12.lan'!D345","v":"ARG Argentina"},"Argentina",{"$f":"VLOOKUP(B28,'12.ppp data'!$C$3:$J$273,7,FALSE())","v":{"v":1.62747059071785,"d":"1.6"}},{"$f":"IF(VLOOKUP(B28,'12.ppp data'!$C$3:$J$273,8,FALSE())=\"est\",\"est\",\"-\")","v":"-"},"Americas",{"v":4,"d":"4.0"},{"$nulls":3},"ARG"]
[{"$f":"'12.lan'!D346","v":"ARM Armenia"},"Armenia",{"$f":"VLOOKUP(B29,'12.ppp data'!$C$3:$J$273,7,FALSE())","v":{"v":2.67236733754238,"d":"2.7"}},{"$f":"IF(VLOOKUP(B29,'12.ppp data'!$C$3:$J$273,8,FALSE())=\"est\",\"est\",\"-\")","v":"-"},"Asia",{"v":4.17857142857143,"d":"4.2"},"est",null,null,"ARM"]
[{"$f":"'12.lan'!D347","v":"ASM American Samoa"},"American Samoa",{"$f":"VLOOKUP(B30,'12.ppp data'!$C$3:$J$273,7,FALSE())","v":{"v":1.35633083709363,"d":"1.4"}},{"$f":"IF(VLOOKUP(B30,'12.ppp data'!$C$3:$J$273,8,FALSE())=\"est\",\"est\",\"-\")","v":"est"},"Oceania",{"v":3,"d":"3.0"},{"$nulls":3},"ASM"]
[{"$f":"'12.lan'!D348","v":"ATG Antigua and Barbuda"},"Antigua and Barbuda",{"$f":"VLOOKUP(B31,'12.ppp data'!$C$3:$J$273,7,FALSE())","v":{"v":1.77403645769243,"d":"1.8"}},{"$f":"IF(VLOOKUP(B31,'12.ppp data'!$C$3:$J$273,8,FALSE())=\"est\",\"est\",\"-\")","v":"-"},"Americas",{"v":3.42105263157895,"d":"3.4"},"est",null,null,"ATG"]
[{"$f":"'12.lan'!D349","v":"AUS Australia"},"Australia",{"$f":"VLOOKUP(B32,'12.ppp data'!$C$3:$J$273,7,FALSE())","v":{"v":0.972051582845554,"d":"1.0"}},{"$f":"IF(VLOOKUP(B32,'12.ppp data'!$C$3:$J$273,8,FALSE())=\"est\",\"est\",\"-\")","v":"-"},"Oceania",{"v":3,"d":"3.0"},"est",null,null,"AUS"]
[{"$f":"'12.lan'!D350","v":"AUT Austria"},"Austria",{"$f":"VLOOKUP(B33,'12.ppp data'!$C$3:$J$273,7,FALSE())","v":{"v":1.2523873634115,"d":"1.3"}},{"$f":"IF(VLOOKUP(B33,'12.ppp data'!$C$3:$J$273,8,FALSE())=\"est\",\"est\",\"-\")","v":"-"},"Europe",{"v":1,"d":"1.0"},{"$nulls":3},"AUT"]
[{"$f":"'12.lan'!D351","v":"AZE Azerbaijan"},"Azerbaijan",{"$f":"VLOOKUP(B34,'12.ppp data'!$C$3:$J$273,7,FALSE())","v":{"v":4.73103091714864,"d":"4.7"}},{"$f":"IF(VLOOKUP(B34,'12.ppp data'!$C$3:$J$273,8,FALSE())=\"est\",\"est\",\"-\")","v":"-"},"Asia",{"v":4.17857142857143,"d":"4.2"},"est",null,null,"AZE"]
[{"$f":"'12.lan'!D352","v":"BDI Burundi"},"Burundi",{"$f":"VLOOKUP(B35,'12.ppp data'!$C$3:$J$273,7,FALSE())","v":{"v":2.67367256673563,"d":"2.7"}},{"$f":"IF(VLOOKUP(B35,'12.ppp data'!$C$3:$J$273,8,FALSE())=\"est\",\"est\",\"-\")","v":"-"},"Africa",{"v":3.70833333333333,"d":"3.7"},"est",null,null,"BDI"]
[{"$f":"'12.lan'!D353","v":"BEL Belgium"},"Belgium",{"$f":"VLOOKUP(B36,'12.ppp data'!$C$3:$J$273,7,FALSE())","v":{"v":1.23710472957509,"d":"1.2"}},{"$f":"IF(VLOOKUP(B36,'12.ppp data'!$C$3:$J$273,8,FALSE())=\"est\",\"est\",\"-\")","v":"-"},"Europe",{"v":1,"d":"1.0"},{"$nulls":3},"BEL"]
[{"$f":"'12.lan'!D354","v":"BEN Benin"},"Benin",{"$f":"VLOOKUP(B37,'12.ppp data'!$C$3:$J$273,7,FALSE())","v":{"v":3.08829265535391,"d":"3.1"}},{"$f":"IF(VLOOKUP(B37,'12.ppp data'!$C$3:$J$273,8,FALSE())=\"est\",\"est\",\"-\")","v":"-"},"Africa",{"v":3.70833333333333,"d":"3.7"},"est",null,null,"BEN"]
[{"$f":"'12.lan'!D355","v":"BFA Burkina Faso"},"Burkina Faso",{"$f":"VLOOKUP(B38,'12.ppp data'!$C$3:$J$273,7,FALSE())","v":{"v":3.14412039894307,"d":"3.1"}},{"$f":"IF(VLOOKUP(B38,'12.ppp data'!$C$3:$J$273,8,FALSE())=\"est\",\"est\",\"-\")","v":"-"},"Africa",{"v":3.70833333333333,"d":"3.7"},"est",null,null,"BFA"]
[{"$f":"'12.lan'!D356","v":"BGD Bangladesh"},"Bangladesh",{"$f":"VLOOKUP(B39,'12.ppp data'!$C$3:$J$273,7,FALSE())","v":{"v":2.91129894902451,"d":"2.9"}},{"$f":"IF(VLOOKUP(B39,'12.ppp data'!$C$3:$J$273,8,FALSE())=\"est\",\"est\",\"-\")","v":"-"},"Asia",{"v":5,"d":"5.0"},{"$nulls":3},"BGD"]
[{"$f":"'12.lan'!D357","v":"BGR Bulgaria"},"Bulgaria",{"$f":"VLOOKUP(B40,'12.ppp data'!$C$3:$J$273,7,FALSE())","v":{"v":2.84731792906487,"d":"2.8"}},{"$f":"IF(VLOOKUP(B40,'12.ppp data'!$C$3:$J$273,8,FALSE())=\"est\",\"est\",\"-\")","v":"-"},"Europe",{"v":3,"d":"3.0"},{"$nulls":3},"BGR"]
[{"$f":"'12.lan'!D358","v":"BHR Bahrain"},"Bahrain",{"$f":"VLOOKUP(B41,'12.ppp data'!$C$3:$J$273,7,FALSE())","v":{"v":2.25756428214409,"d":"2.3"}},{"$f":"IF(VLOOKUP(B41,'12.ppp data'!$C$3:$J$273,8,FALSE())=\"est\",\"est\",\"-\")","v":"-"},"Asia",{"v":4,"d":"4.0"},{"$nulls":3},"BHR"]
[{"$f":"'12.lan'!D359","v":"BHS Bahamas"},"Bahamas, The",{"$f":"VLOOKUP(B42,'12.ppp data'!$C$3:$J$273,7,FALSE())","v":{"v":1.11730570926189,"d":"1.1"}},{"$f":"IF(VLOOKUP(B42,'12.ppp data'!$C$3:$J$273,8,FALSE())=\"est\",\"est\",\"-\")","v":"-"},"Americas",{"v":3.42105263157895,"d":"3.4"},"est",null,null,"BHS"]
[{"$f":"'12.lan'!D360","v":"BIH Bosnia and Herzegovina"},"Bosnia and Herzegovina",{"$f":"VLOOKUP(B43,'12.ppp data'!$C$3:$J$273,7,FALSE())","v":{"v":2.8020129058,"d":"2.8"}},{"$f":"IF(VLOOKUP(B43,'12.ppp data'!$C$3:$J$273,8,FALSE())=\"est\",\"est\",\"-\")","v":"-"},"Europe",{"v":2,"d":"2.0"},{"$nulls":3},"BIH"]
[{"$f":"'12.lan'!D361","v":"BLR Belarus"},"Belarus",{"$f":"VLOOKUP(B44,'12.ppp data'!$C$3:$J$273,7,FALSE())","v":{"v":3.80461418295071,"d":"3.8"}},{"$f":"IF(VLOOKUP(B44,'12.ppp data'!$C$3:$J$273,8,FALSE())=\"est\",\"est\",\"-\")","v":"-"},"Europe",{"v":5,"d":"5.0"},{"$nulls":3},"BLR"]
[{"$f":"'12.lan'!D362","v":"BLZ Belize"},"Belize",{"$f":"VLOOKUP(B45,'12.ppp data'!$C$3:$J$273,7,FALSE())","v":{"v":1.97784561070438,"d":"2.0"}},{"$f":"IF(VLOOKUP(B45,'12.ppp data'!$C$3:$J$273,8,FALSE())=\"est\",\"est\",\"-\")","v":"-"},"Americas",{"v":3.42105263157895,"d":"3.4"},"est",null,null,"BLZ"]
[{"$f":"'12.lan'!D363","v":"BMU Bermuda"},"Bermuda",{"$f":"VLOOKUP(B46,'12.ppp data'!$C$3:$J$273,7,FALSE())","v":{"v":1.96289944979353,"d":"2.0"}},{"$f":"IF(VLOOKUP(B46,'12.ppp data'!$C$3:$J$273,8,FALSE())=\"est\",\"est\",\"-\")","v":"est"},"Americas",{"v":3.42105263157895,"d":"3.4"},"est",null,null,"BMU"]
[{"$f":"'12.lan'!D364","v":"BOL Bolivia, Plurinational State of"},"Bolivia",{"$f":"VLOOKUP(B47,'12.ppp data'!$C$3:$J$273,7,FALSE())","v":{"v":2.46756228664802,"d":"2.5"}},{"$f":"IF(VLOOKUP(B47,'12.ppp data'!$C$3:$J$273,8,FALSE())=\"est\",\"est\",\"-\")","v":"-"},"Americas",{"v":3,"d":"3.0"},{"$nulls":3},"BOL"]
[{"$f":"'12.lan'!D365","v":"BRA Brazil"},"Brazil",{"$f":"VLOOKUP(B48,'12.ppp data'!$C$3:$J$273,7,FALSE())","v":{"v":1.78027211262309,"d":"1.8"}},{"$f":"IF(VLOOKUP(B48,'12.ppp data'!$C$3:$J$273,8,FALSE())=\"est\",\"est\",\"-\")","v":"-"},"Americas",{"v":3,"d":"3.0"},{"$nulls":3},"BRA"]
[{"$f":"'12.lan'!D366","v":"BRB Barbados"},"Barbados",{"$f":"VLOOKUP(B49,'12.ppp data'!$C$3:$J$273,7,FALSE())","v":{"v":1.25400385466135,"d":"1.3"}},{"$f":"IF(VLOOKUP(B49,'12.ppp data'!$C$3:$J$273,8,FALSE())=\"est\",\"est\",\"-\")","v":"-"},"Americas",{"v":3.42105263157895,"d":"3.4"},"est",null,null,"BRB"]
[{"$f":"'12.lan'!D367","v":"BRN Brunei Darussalam"},"Brunei Darussalam",{"$f":"VLOOKUP(B50,'12.ppp data'!$C$3:$J$273,7,FALSE())","v":{"v":3.11761815281005,"d":"3.1"}},{"$f":"IF(VLOOKUP(B50,'12.ppp data'!$C$3:$J$273,8,FALSE())=\"est\",\"est\",\"-\")","v":"-"},"Asia",{"v":4.17857142857143,"d":"4.2"},"est",null,null,"BRN"]
[{"$f":"'12.lan'!D368","v":"BTN Bhutan"},"Bhutan",{"$f":"VLOOKUP(B51,'12.ppp data'!$C$3:$J$273,7,FALSE())","v":{"v":3.32340929187407,"d":"3.3"}},{"$f":"IF(VLOOKUP(B51,'12.ppp data'!$C$3:$J$273,8,FALSE())=\"est\",\"est\",\"-\")","v":"-"},"Asia",{"v":4.17857142857143,"d":"4.2"},"est",null,null,"BTN"]
[{"$f":"'12.lan'!D369","v":"BWA Botswana"},"Botswana",{"$f":"VLOOKUP(B52,'12.ppp data'!$C$3:$J$273,7,FALSE())","v":{"v":2.55030434987067,"d":"2.6"}},{"$f":"IF(VLOOKUP(B52,'12.ppp data'!$C$3:$J$273,8,FALSE())=\"est\",\"est\",\"-\")","v":"-"},"Africa",{"v":4,"d":"4.0"},{"$nulls":3},"BWA"]
[{"$f":"'12.lan'!D370","v":"CAF Central African Republic"},"Central African Republic",{"$f":"VLOOKUP(B53,'12.ppp data'!$C$3:$J$273,7,FALSE())","v":{"v":1.95902564248837,"d":"2.0"}},{"$f":"IF(VLOOKUP(B53,'12.ppp data'!$C$3:$J$273,8,FALSE())=\"est\",\"est\",\"-\")","v":"-"},"Africa",{"v":3.70833333333333,"d":"3.7"},"est",null,null,"CAF"]
[{"$f":"'12.lan'!D371","v":"CAN Canada"},"Canada",{"$f":"VLOOKUP(B54,'12.ppp data'!$C$3:$J$273,7,FALSE())","v":{"v":1.16347457237046,"d":"1.2"}},{"$f":"IF(VLOOKUP(B54,'12.ppp data'!$C$3:$J$273,8,FALSE())=\"est\",\"est\",\"-\")","v":"-"},"Americas",{"v":3,"d":"3.0"},{"$nulls":3},"CAN"]
[{"$f":"'12.lan'!D372","v":"CHE Switzerland"},"Switzerland",{"$f":"VLOOKUP(B55,'12.ppp data'!$C$3:$J$273,7,FALSE())","v":{"v":0.915388283910166,"d":"0.9"}},{"$f":"IF(VLOOKUP(B55,'12.ppp data'!$C$3:$J$273,8,FALSE())=\"est\",\"est\",\"-\")","v":"-"},"Europe",{"v":2,"d":"2.0"},"est",null,null,"CHE"]
[{"$f":"'12.lan'!D373","v":"CHL Chile"},"Chile",{"$f":"VLOOKUP(B56,'12.ppp data'!$C$3:$J$273,7,FALSE())","v":{"v":1.76442448139645,"d":"1.8"}},{"$f":"IF(VLOOKUP(B56,'12.ppp data'!$C$3:$J$273,8,FALSE())=\"est\",\"est\",\"-\")","v":"-"},"Americas",{"v":3,"d":"3.0"},{"$nulls":3},"CHL"]
[{"$f":"'12.lan'!D374","v":"CHN China"},"China",{"$f":"VLOOKUP(B57,'12.ppp data'!$C$3:$J$273,7,FALSE())","v":{"v":2.15037979616706,"d":"2.2"}},{"$f":"IF(VLOOKUP(B57,'12.ppp data'!$C$3:$J$273,8,FALSE())=\"est\",\"est\",\"-\")","v":"-"},"Asia",{"v":5,"d":"5.0"},{"$nulls":3},"CHN"]
[{"$f":"'12.lan'!D375","v":"CIV Côte d'Ivoire"},"Cote d'Ivoire",{"$f":"VLOOKUP(B58,'12.ppp data'!$C$3:$J$273,7,FALSE())","v":{"v":2.68358914431382,"d":"2.7"}},{"$f":"IF(VLOOKUP(B58,'12.ppp data'!$C$3:$J$273,8,FALSE())=\"est\",\"est\",\"-\")","v":"-"},"Africa",{"v":5,"d":"5.0"},{"$nulls":3},"CIV"]
[{"$f":"'12.lan'!D376","v":"CMR Cameroon"},"Cameroon",{"$f":"VLOOKUP(B59,'12.ppp data'!$C$3:$J$273,7,FALSE())","v":{"v":2.883238648488,"d":"2.9"}},{"$f":"IF(VLOOKUP(B59,'12.ppp data'!$C$3:$J$273,8,FALSE())=\"est\",\"est\",\"-\")","v":"-"},"Africa",{"v":2,"d":"2.0"},{"$nulls":3},"CMR"]
[{"$f":"'12.lan'!D377","v":"COD Congo, the Democratic Republic of the"},"Congo, Dem. Rep.",{"$f":"VLOOKUP(B60,'12.ppp data'!$C$3:$J$273,7,FALSE())","v":{"v":2.12993928105123,"d":"2.1"}},{"$f":"IF(VLOOKUP(B60,'12.ppp data'!$C$3:$J$273,8,FALSE())=\"est\",\"est\",\"-\")","v":"-"},"Africa",{"v":4,"d":"4.0"},{"$nulls":3},"COD"]
[{"$f":"'12.lan'!D378","v":"COG Congo"},"Congo, Rep.",{"$f":"VLOOKUP(B61,'12.ppp data'!$C$3:$J$273,7,FALSE())","v":{"v":3.6495000244035,"d":"3.6"}},{"$f":"IF(VLOOKUP(B61,'12.ppp data'!$C$3:$J$273,8,FALSE())=\"est\",\"est\",\"-\")","v":"-"},"Africa",{"v":3,"d":"3.0"},{"$nulls":3},"COG"]
[{"$f":"'12.lan'!D379","v":"COL Colombia"},"Colombia",{"$f":"VLOOKUP(B62,'12.ppp data'!$C$3:$J$273,7,FALSE())","v":{"v":2.59989679628651,"d":"2.6"}},{"$f":"IF(VLOOKUP(B62,'12.ppp data'!$C$3:$J$273,8,FALSE())=\"est\",\"est\",\"-\")","v":"-"},"Americas",{"v":5,"d":"5.0"},{"$nulls":3},"COL"]
[{"$f":"'12.lan'!D380","v":"COM Comoros"},"Comoros",{"$f":"VLOOKUP(B63,'12.ppp data'!$C$3:$J$273,7,FALSE())","v":{"v":2.1983905043498,"d":"2.2"}},{"$f":"IF(VLOOKUP(B63,'12.ppp data'!$C$3:$J$273,8,FALSE())=\"est\",\"est\",\"-\")","v":"-"},"Africa",{"v":3.70833333333333,"d":"3.7"},"est",null,null,"COM"]
[{"$f":"'12.lan'!D381","v":"CPV Cape Verde"},"Cabo Verde",{"$f":"VLOOKUP(B64,'12.ppp data'!$C$3:$J$273,7,FALSE())","v":{"v":2.40219140752974,"d":"2.4"}},{"$f":"IF(VLOOKUP(B64,'12.ppp data'!$C$3:$J$273,8,FALSE())=\"est\",\"est\",\"-\")","v":"-"},"Africa",{"v":3.70833333333333,"d":"3.7"},"est",null,null,"CPV"]
[{"$f":"'12.lan'!D382","v":"CRI Costa Rica"},"Costa Rica",{"$f":"VLOOKUP(B65,'12.ppp data'!$C$3:$J$273,7,FALSE())","v":{"v":1.60112437517919,"d":"1.6"}},{"$f":"IF(VLOOKUP(B65,'12.ppp data'!$C$3:$J$273,8,FALSE())=\"est\",\"est\",\"-\")","v":"-"},"Americas",{"v":3,"d":"3.0"},{"$nulls":3},"CRI"]
[{"$f":"'12.lan'!D383","v":"CUB Cuba"},"Cuba",{"$f":"VLOOKUP(B66,'12.ppp data'!$C$3:$J$273,7,FALSE())","v":{"v":1.96289944979353,"d":"2.0"}},{"$f":"IF(VLOOKUP(B66,'12.ppp data'!$C$3:$J$273,8,FALSE())=\"est\",\"est\",\"-\")","v":"est"},"Americas",{"v":3.42105263157895,"d":"3.4"},"est",null,null,"CUB"]
[{"$f":"'12.lan'!D384","v":"CUW Curaçao"},"Curacao",{"$f":"VLOOKUP(B67,'12.ppp data'!$C$3:$J$273,7,FALSE())","v":{"v":1.96289944979353,"d":"2.0"}},{"$f":"IF(VLOOKUP(B67,'12.ppp data'!$C$3:$J$273,8,FALSE())=\"est\",\"est\",\"-\")","v":"est"},"Americas",{"v":3.42105263157895,"d":"3.4"},"est",null,null,"CUW"]
[{"$f":"'12.lan'!D385","v":"CYM Cayman Islands"},"Cayman Islands",{"$f":"VLOOKUP(B68,'12.ppp data'!$C$3:$J$273,7,FALSE())","v":{"v":1.96289944979353,"d":"2.0"}},{"$f":"IF(VLOOKUP(B68,'12.ppp data'!$C$3:$J$273,8,FALSE())=\"est\",\"est\",\"-\")","v":"est"},"Americas",{"v":3.42105263157895,"d":"3.4"},"est",null,null,"CYM"]
[{"$f":"'12.lan'!D386","v":"CYP Cyprus"},"Cyprus",{"$f":"VLOOKUP(B69,'12.ppp data'!$C$3:$J$273,7,FALSE())","v":{"v":1.54086517177572,"d":"1.5"}},{"$f":"IF(VLOOKUP(B69,'12.ppp data'!$C$3:$J$273,8,FALSE())=\"est\",\"est\",\"-\")","v":"-"},"Asia",{"v":4.17857142857143,"d":"4.2"},"est",null,null,"CYP"]
[{"$f":"'12.lan'!D387","v":"CZE Czech Republic"},"Czech Republic",{"$f":"VLOOKUP(B70,'12.ppp data'!$C$3:$J$273,7,FALSE())","v":{"v":2.04587492829756,"d":"2.0"}},{"$f":"IF(VLOOKUP(B70,'12.ppp data'!$C$3:$J$273,8,FALSE())=\"est\",\"est\",\"-\")","v":"-"},"Europe",{"v":2,"d":"2.0"},{"$nulls":3},"CZE"]
[{"$f":"'12.lan'!D388","v":"DEU Germany"},"Germany",{"$f":"VLOOKUP(B71,'12.ppp data'!$C$3:$J$273,7,FALSE())","v":{"v":1.28515872995474,"d":"1.3"}},{"$f":"IF(VLOOKUP(B71,'12.ppp data'!$C$3:$J$273,8,FALSE())=\"est\",\"est\",\"-\")","v":"-"},"Europe",{"v":1,"d":"1.0"},{"$nulls":3},"DEU"]
[{"$f":"'12.lan'!D389","v":"DJI Djibouti"},"Djibouti",{"$f":"VLOOKUP(B72,'12.ppp data'!$C$3:$J$273,7,FALSE())","v":{"v":3.03256163278312,"d":"3.0"}},{"$f":"IF(VLOOKUP(B72,'12.ppp data'!$C$3:$J$273,8,FALSE())=\"est\",\"est\",\"-\")","v":"est"},"Africa",{"v":3.70833333333333,"d":"3.7"},"est",null,null,"DJI"]
[{"$f":"'12.lan'!D390","v":"DMA Dominica"},"Dominica",{"$f":"VLOOKUP(B73,'12.ppp data'!$C$3:$J$273,7,FALSE())","v":{"v":1.57631235380568,"d":"1.6"}},{"$f":"IF(VLOOKUP(B73,'12.ppp data'!$C$3:$J$273,8,FALSE())=\"est\",\"est\",\"-\")","v":"-"},"Americas",{"v":3.42105263157895,"d":"3.4"},"est",null,null,"DMA"]
[{"$f":"'12.lan'!D391","v":"DNK Denmark"},"Denmark",{"$f":"VLOOKUP(B74,'12.ppp data'!$C$3:$J$273,7,FALSE())","v":{"v":1.01296444948685,"d":"1.0"}},{"$f":"IF(VLOOKUP(B74,'12.ppp data'!$C$3:$J$273,8,FALSE())=\"est\",\"est\",\"-\")","v":"-"},"Europe",{"v":1,"d":"1.0"},{"$nulls":3},"DNK"]
[{"$f":"'12.lan'!D392","v":"DOM Dominican Republic"},"Dominican Republic",{"$f":"VLOOKUP(B75,'12.ppp data'!$C$3:$J$273,7,FALSE())","v":{"v":2.52709449445265,"d":"2.5"}},{"$f":"IF(VLOOKUP(B75,'12.ppp data'!$C$3:$J$273,8,FALSE())=\"est\",\"est\",\"-\")","v":"-"},"Americas",{"v":2,"d":"2.0"},{"$nulls":3},"DOM"]
[{"$f":"'12.lan'!D393","v":"DZA Algeria"},"Algeria",{"$f":"VLOOKUP(B76,'12.ppp data'!$C$3:$J$273,7,FALSE())","v":{"v":4.16426228483382,"d":"4.2"}},{"$f":"IF(VLOOKUP(B76,'12.ppp data'!$C$3:$J$273,8,FALSE())=\"est\",\"est\",\"-\")","v":"-"},"Africa",{"v":5,"d":"5.0"},{"$nulls":3},"DZA"]
[{"$f":"'12.lan'!D394","v":"ECU Ecuador"},"Ecuador",{"$f":"VLOOKUP(B77,'12.ppp data'!$C$3:$J$273,7,FALSE())","v":{"v":2.11677387007622,"d":"2.1"}},{"$f":"IF(VLOOKUP(B77,'12.ppp data'!$C$3:$J$273,8,FALSE())=\"est\",\"est\",\"-\")","v":"-"},"Americas",{"v":3,"d":"3.0"},{"$nulls":3},"ECU"]
[{"$f":"'12.lan'!D395","v":"EGY Egypt"},"Egypt, Arab Rep.",{"$f":"VLOOKUP(B78,'12.ppp data'!$C$3:$J$273,7,FALSE())","v":{"v":6.55173951984856,"d":"6.6"}},{"$f":"IF(VLOOKUP(B78,'12.ppp data'!$C$3:$J$273,8,FALSE())=\"est\",\"est\",\"-\")","v":"-"},"Africa",{"v":5,"d":"5.0"},{"$nulls":3},"EGY"]
[{"$f":"'12.lan'!D396","v":"ERI Eritrea"},"Eritrea",{"$f":"VLOOKUP(B79,'12.ppp data'!$C$3:$J$273,7,FALSE())","v":{"v":3.03256163278312,"d":"3.0"}},{"$f":"IF(VLOOKUP(B79,'12.ppp data'!$C$3:$J$273,8,FALSE())=\"est\",\"est\",\"-\")","v":"est"},"Africa",{"v":3.70833333333333,"d":"3.7"},"est",null,null,"ERI"]
[{"$f":"'12.lan'!D397","v":"ESP Spain"},"Spain",{"$f":"VLOOKUP(B80,'12.ppp data'!$C$3:$J$273,7,FALSE())","v":{"v":1.52447390405571,"d":"1.5"}},{"$f":"IF(VLOOKUP(B80,'12.ppp data'!$C$3:$J$273,8,FALSE())=\"est\",\"est\",\"-\")","v":"-"},"Europe",{"v":2,"d":"2.0"},{"$nulls":3},"ESP"]
[{"$f":"'12.lan'!D398","v":"EST Estonia"},"Estonia",{"$f":"VLOOKUP(B81,'12.ppp data'!$C$3:$J$273,7,FALSE())","v":{"v":1.80932926354871,"d":"1.8"}},{"$f":"IF(VLOOKUP(B81,'12.ppp data'!$C$3:$J$273,8,FALSE())=\"est\",\"est\",\"-\")","v":"-"},"Europe",{"v":1,"d":"1.0"},{"$nulls":3},"EST"]
[{"$f":"'12.lan'!D399","v":"ETH Ethiopia"},"Ethiopia",{"$f":"VLOOKUP(B82,'12.ppp data'!$C$3:$J$273,7,FALSE())","v":{"v":2.95615597273597,"d":"3.0"}},{"$f":"IF(VLOOKUP(B82,'12.ppp data'!$C$3:$J$273,8,FALSE())=\"est\",\"est\",\"-\")","v":"-"},"Africa",{"v":3,"d":"3.0"},{"$nulls":3},"ETH"]
[{"$f":"'12.lan'!D400","v":"FIN Finland"},"Finland",{"$f":"VLOOKUP(B83,'12.ppp data'!$C$3:$J$273,7,FALSE())","v":{"v":1.11427317075345,"d":"1.1"}},{"$f":"IF(VLOOKUP(B83,'12.ppp data'!$C$3:$J$273,8,FALSE())=\"est\",\"est\",\"-\")","v":"-"},"Europe",{"v":1,"d":"1.0"},{"$nulls":3},"FIN"]
[{"$f":"'12.lan'!D401","v":"FJI Fiji"},"Fiji",{"$f":"VLOOKUP(B84,'12.ppp data'!$C$3:$J$273,7,FALSE())","v":{"v":1.91198514556138,"d":"1.9"}},{"$f":"IF(VLOOKUP(B84,'12.ppp data'!$C$3:$J$273,8,FALSE())=\"est\",\"est\",\"-\")","v":"-"},"Oceania",{"v":3,"d":"3.0"},"est",null,null,"FJI"]
[{"$f":"'12.lan'!D402","v":"FRA France"},"France",{"$f":"VLOOKUP(B85,'12.ppp data'!$C$3:$J$273,7,FALSE())","v":{"v":1.25289418556866,"d":"1.3"}},{"$f":"IF(VLOOKUP(B85,'12.ppp data'!$C$3:$J$273,8,FALSE())=\"est\",\"est\",\"-\")","v":"-"},"Europe",{"v":1,"d":"1.0"},{"$nulls":3},"FRA"]
[{"$f":"'12.lan'!D403","v":"FRO Faroe Islands"},"Faroe Islands",{"$f":"VLOOKUP(B86,'12.ppp data'!$C$3:$J$273,7,FALSE())","v":{"v":1.93286164519776,"d":"1.9"}},{"$f":"IF(VLOOKUP(B86,'12.ppp data'!$C$3:$J$273,8,FALSE())=\"est\",\"est\",\"-\")","v":"est"},"Europe",{"v":2,"d":"2.0"},"est",null,null,"FRO"]
[{"$f":"'12.lan'!D404","v":"FSM Micronesia, Federated States of"},"Micronesia, Fed. Sts.",{"$f":"VLOOKUP(B87,'12.ppp data'!$C$3:$J$273,7,FALSE())","v":{"v":1.28354960501633,"d":"1.3"}},{"$f":"IF(VLOOKUP(B87,'12.ppp data'!$C$3:$J$273,8,FALSE())=\"est\",\"est\",\"-\")","v":"-"},"Oceania",{"v":3,"d":"3.0"},"est",null,null,"FSM"]
[{"$f":"'12.lan'!D405","v":"GAB Gabon"},"Gabon",{"$f":"VLOOKUP(B88,'12.ppp data'!$C$3:$J$273,7,FALSE())","v":{"v":2.84334462825291,"d":"2.8"}},{"$f":"IF(VLOOKUP(B88,'12.ppp data'!$C$3:$J$273,8,FALSE())=\"est\",\"est\",\"-\")","v":"-"},"Africa",{"v":3.70833333333333,"d":"3.7"},"est",null,null,"GAB"]
[{"$f":"'12.lan'!D406","v":"GBR United Kingdom"},"United Kingdom",{"$f":"VLOOKUP(B89,'12.ppp data'!$C$3:$J$273,7,FALSE())","v":{"v":1.2471403241674,"d":"1.2"}},{"$f":"IF(VLOOKUP(B89,'12.ppp data'!$C$3:$J$273,8,FALSE())=\"est\",\"est\",\"-\")","v":"-"},"Europe",{"v":3,"d":"3.0"},{"$nulls":3},"GBR"]
[{"$f":"'12.lan'!D407","v":"GEO Georgia"},"Georgia",{"$f":"VLOOKUP(B90,'12.ppp data'!$C$3:$J$273,7,FALSE())","v":{"v":2.94235866883313,"d":"2.9"}},{"$f":"IF(VLOOKUP(B90,'12.ppp data'!$C$3:$J$273,8,FALSE())=\"est\",\"est\",\"-\")","v":"-"},"Asia",{"v":3,"d":"3.0"},{"$nulls":3},"GEO"]
[{"$f":"'12.lan'!D408","v":"GHA Ghana"},"Ghana",{"$f":"VLOOKUP(B91,'12.ppp data'!$C$3:$J$273,7,FALSE())","v":{"v":3.21490765229489,"d":"3.2"}},{"$f":"IF(VLOOKUP(B91,'12.ppp data'!$C$3:$J$273,8,FALSE())=\"est\",\"est\",\"-\")","v":"-"},"Africa",{"v":3,"d":"3.0"},{"$nulls":3},"GHA"]
[{"$f":"'12.lan'!D409","v":"GIB Gibraltar"},"Gibraltar",{"$f":"VLOOKUP(B92,'12.ppp data'!$C$3:$J$273,7,FALSE())","v":{"v":1.93286164519776,"d":"1.9"}},{"$f":"IF(VLOOKUP(B92,'12.ppp data'!$C$3:$J$273,8,FALSE())=\"est\",\"est\",\"-\")","v":"est"},"Europe",{"v":2,"d":"2.0"},"est",null,null,"GIB"]
[{"$f":"'12.lan'!D410","v":"GIN Guinea"},"Guinea",{"$f":"VLOOKUP(B93,'12.ppp data'!$C$3:$J$273,7,FALSE())","v":{"v":3.01592206857968,"d":"3.0"}},{"$f":"IF(VLOOKUP(B93,'12.ppp data'!$C$3:$J$273,8,FALSE())=\"est\",\"est\",\"-\")","v":"-"},"Africa",{"v":3.70833333333333,"d":"3.7"},"est",null,null,"GIN"]
[{"$f":"'12.lan'!D411","v":"GMB Gambia"},"Gambia, The",{"$f":"VLOOKUP(B94,'12.ppp data'!$C$3:$J$273,7,FALSE())","v":{"v":3.86717588280632,"d":"3.9"}},{"$f":"IF(VLOOKUP(B94,'12.ppp data'!$C$3:$J$273,8,FALSE())=\"est\",\"est\",\"-\")","v":"-"},"Africa",{"v":3.70833333333333,"d":"3.7"},"est",null,null,"GMB"]
[{"$f":"'12.lan'!D412","v":"GNB Guinea-Bissau"},"Guinea-Bissau",{"$f":"VLOOKUP(B95,'12.ppp data'!$C$3:$J$273,7,FALSE())","v":{"v":2.65133912964036,"d":"2.7"}},{"$f":"IF(VLOOKUP(B95,'12.ppp data'!$C$3:$J$273,8,FALSE())=\"est\",\"est\",\"-\")","v":"-"},"Africa",{"v":3.70833333333333,"d":"3.7"},"est",null,null,"GNB"]
[{"$f":"'12.lan'!D413","v":"GNQ Equatorial Guinea"},"Equatorial Guinea",{"$f":"VLOOKUP(B96,'12.ppp data'!$C$3:$J$273,7,FALSE())","v":{"v":2.84478640455259,"d":"2.8"}},{"$f":"IF(VLOOKUP(B96,'12.ppp data'!$C$3:$J$273,8,FALSE())=\"est\",\"est\",\"-\")","v":"-"},"Africa",{"v":3.70833333333333,"d":"3.7"},"est",null,null,"GNQ"]
[{"$f":"'12.lan'!D414","v":"GRC Greece"},"Greece",{"$f":"VLOOKUP(B97,'12.ppp data'!$C$3:$J$273,7,FALSE())","v":{"v":1.68363206578287,"d":"1.7"}},{"$f":"IF(VLOOKUP(B97,'12.ppp data'!$C$3:$J$273,8,FALSE())=\"est\",\"est\",\"-\")","v":"-"},"Europe",{"v":5,"d":"5.0"},{"$nulls":3},"GRC"]
[{"$f":"'12.lan'!D415","v":"GRD Grenada"},"Grenada",{"$f":"VLOOKUP(B98,'12.ppp data'!$C$3:$J$273,7,FALSE())","v":{"v":1.62454270208294,"d":"1.6"}},{"$f":"IF(VLOOKUP(B98,'12.ppp data'!$C$3:$J$273,8,FALSE())=\"est\",\"est\",\"-\")","v":"-"},"Americas",{"v":3.42105263157895,"d":"3.4"},"est",null,null,"GRD"]
[{"$f":"'12.lan'!D416","v":"GRL Greenland"},"Greenland",{"$f":"VLOOKUP(B99,'12.ppp data'!$C$3:$J$273,7,FALSE())","v":{"v":1.96289944979353,"d":"2.0"}},{"$f":"IF(VLOOKUP(B99,'12.ppp data'!$C$3:$J$273,8,FALSE())=\"est\",\"est\",\"-\")","v":"est"},"Americas",{"v":3.42105263157895,"d":"3.4"},"est",null,null,"GRL"]
[{"$f":"'12.lan'!D417","v":"GTM Guatemala"},"Guatemala",{"$f":"VLOOKUP(B100,'12.ppp data'!$C$3:$J$273,7,FALSE())","v":{"v":2.01278962314171,"d":"2.0"}},{"$f":"IF(VLOOKUP(B100,'12.ppp data'!$C$3:$J$273,8,FALSE())=\"est\",\"est\",\"-\")","v":"-"},"Americas",{"v":5,"d":"5.0"},{"$nulls":3},"GTM"]
[{"$f":"'12.lan'!D418","v":"GUM Guam"},"Guam",{"$f":"VLOOKUP(B101,'12.ppp data'!$C$3:$J$273,7,FALSE())","v":{"v":1.35633083709363,"d":"1.4"}},{"$f":"IF(VLOOKUP(B101,'12.ppp data'!$C$3:$J$273,8,FALSE())=\"est\",\"est\",\"-\")","v":"est"},"Oceania",{"v":3,"d":"3.0"},"est",null,null,"GUM"]
[{"$f":"'12.lan'!D419","v":"GUY Guyana"},"Guyana",{"$f":"VLOOKUP(B102,'12.ppp data'!$C$3:$J$273,7,FALSE())","v":{"v":1.87836494216092,"d":"1.9"}},{"$f":"IF(VLOOKUP(B102,'12.ppp data'!$C$3:$J$273,8,FALSE())=\"est\",\"est\",\"-\")","v":"-"},"Americas",{"v":3.42105263157895,"d":"3.4"},"est",null,null,"GUY"]
[{"$f":"'12.lan'!D420","v":"HKG Hong Kong"},"Hong Kong SAR, China",{"$f":"VLOOKUP(B103,'12.ppp data'!$C$3:$J$273,7,FALSE())","v":{"v":1.50451152741912,"d":"1.5"}},{"$f":"IF(VLOOKUP(B103,'12.ppp data'!$C$3:$J$273,8,FALSE())=\"est\",\"est\",\"-\")","v":"-"},"Asia",{"v":4,"d":"4.0"},{"$nulls":3},"HKG"]
[{"$f":"'12.lan'!D421","v":"HND Honduras"},"Honduras",{"$f":"VLOOKUP(B104,'12.ppp data'!$C$3:$J$273,7,FALSE())","v":{"v":2.2357860143795,"d":"2.2"}},{"$f":"IF(VLOOKUP(B104,'12.ppp data'!$C$3:$J$273,8,FALSE())=\"est\",\"est\",\"-\")","v":"-"},"Americas",{"v":4,"d":"4.0"},{"$nulls":3},"HND"]
[{"$f":"'12.lan'!D422","v":"HRV Croatia"},"Croatia",{"$f":"VLOOKUP(B105,'12.ppp data'!$C$3:$J$273,7,FALSE())","v":{"v":2.14327791531878,"d":"2.1"}},{"$f":"IF(VLOOKUP(B105,'12.ppp data'!$C$3:$J$273,8,FALSE())=\"est\",\"est\",\"-\")","v":"-"},"Europe",{"v":2,"d":"2.0"},{"$nulls":3},"HRV"]
[{"$f":"'12.lan'!D423","v":"HTI Haiti"},"Haiti",{"$f":"VLOOKUP(B106,'12.ppp data'!$C$3:$J$273,7,FALSE())","v":{"v":2.61499172092398,"d":"2.6"}},{"$f":"IF(VLOOKUP(B106,'12.ppp data'!$C$3:$J$273,8,FALSE())=\"est\",\"est\",\"-\")","v":"-"},"Americas",{"v":3.42105263157895,"d":"3.4"},"est",null,null,"HTI"]
[{"$f":"'12.lan'!D424","v":"HUN Hungary"},"Hungary",{"$f":"VLOOKUP(B107,'12.ppp data'!$C$3:$J$273,7,FALSE())","v":{"v":2.25034533624825,"d":"2.3"}},{"$f":"IF(VLOOKUP(B107,'12.ppp data'!$C$3:$J$273,8,FALSE())=\"est\",\"est\",\"-\")","v":"-"},"Europe",{"v":2,"d":"2.0"},{"$nulls":3},"HUN"]
[{"$f":"'12.lan'!D425","v":"IDN Indonesia"},"Indonesia",{"$f":"VLOOKUP(B108,'12.ppp data'!$C$3:$J$273,7,FALSE())","v":{"v":3.59491487646491,"d":"3.6"}},{"$f":"IF(VLOOKUP(B108,'12.ppp data'!$C$3:$J$273,8,FALSE())=\"est\",\"est\",\"-\")","v":"-"},"Asia",{"v":4,"d":"4.0"},{"$nulls":3},"IDN"]
[{"$f":"'12.lan'!D426","v":"IMN Isle of Man"},"Isle of Man",{"$f":"VLOOKUP(B109,'12.ppp data'!$C$3:$J$273,7,FALSE())","v":{"v":1.93286164519776,"d":"1.9"}},{"$f":"IF(VLOOKUP(B109,'12.ppp data'!$C$3:$J$273,8,FALSE())=\"est\",\"est\",\"-\")","v":"est"},"Europe",{"v":2,"d":"2.0"},"est",null,null,"IMN"]
[{"$f":"'12.lan'!D427","v":"IND India"},"India",{"$f":"VLOOKUP(B110,'12.ppp data'!$C$3:$J$273,7,FALSE())","v":{"v":4.14410163958857,"d":"4.1"}},{"$f":"IF(VLOOKUP(B110,'12.ppp data'!$C$3:$J$273,8,FALSE())=\"est\",\"est\",\"-\")","v":"-"},"Asia",{"v":5,"d":"5.0"},{"$nulls":3},"IND"]
[{"$f":"'12.lan'!D428","v":"IRL Ireland"},"Ireland",{"$f":"VLOOKUP(B111,'12.ppp data'!$C$3:$J$273,7,FALSE())","v":{"v":1.2402454693833,"d":"1.2"}},{"$f":"IF(VLOOKUP(B111,'12.ppp data'!$C$3:$J$273,8,FALSE())=\"est\",\"est\",\"-\")","v":"-"},"Europe",{"v":2,"d":"2.0"},{"$nulls":3},"IRL"]
[{"$f":"'12.lan'!D429","v":"IRN Iran, Islamic Republic of"},"Iran, Islamic Rep.",{"$f":"VLOOKUP(B112,'12.ppp data'!$C$3:$J$273,7,FALSE())","v":{"v":4.2651915869607,"d":"4.3"}},{"$f":"IF(VLOOKUP(B112,'12.ppp data'!$C$3:$J$273,8,FALSE())=\"est\",\"est\",\"-\")","v":"-"},"Asia",{"v":4,"d":"4.0"},{"$nulls":3},"IRN"]
[{"$f":"'12.lan'!D430","v":"IRQ Iraq"},"Iraq",{"$f":"VLOOKUP(B113,'12.ppp data'!$C$3:$J$273,7,FALSE())","v":{"v":3.67598777141843,"d":"3.7"}},{"$f":"IF(VLOOKUP(B113,'12.ppp data'!$C$3:$J$273,8,FALSE())=\"est\",\"est\",\"-\")","v":"-"},"Asia",{"v":4,"d":"4.0"},{"$nulls":3},"IRQ"]
[{"$f":"'12.lan'!D431","v":"ISL Iceland"},"Iceland",{"$f":"VLOOKUP(B114,'12.ppp data'!$C$3:$J$273,7,FALSE())","v":{"v":0.859219151517723,"d":"0.9"}},{"$f":"IF(VLOOKUP(B114,'12.ppp data'!$C$3:$J$273,8,FALSE())=\"est\",\"est\",\"-\")","v":"-"},"Europe",{"v":1,"d":"1.0"},{"$nulls":3},"ISL"]
[{"$f":"'12.lan'!D432","v":"ISR Israel"},"Israel",{"$f":"VLOOKUP(B115,'12.ppp data'!$C$3:$J$273,7,FALSE())","v":{"v":1.07621430452531,"d":"1.1"}},{"$f":"IF(VLOOKUP(B115,'12.ppp data'!$C$3:$J$273,8,FALSE())=\"est\",\"est\",\"-\")","v":"-"},"Asia",{"v":3,"d":"3.0"},{"$nulls":3},"ISR"]
[{"$f":"'12.lan'!D433","v":"ITA Italy"},"Italy",{"$f":"VLOOKUP(B116,'12.ppp data'!$C$3:$J$273,7,FALSE())","v":{"v":1.40423799025459,"d":"1.4"}},{"$f":"IF(VLOOKUP(B116,'12.ppp data'!$C$3:$J$273,8,FALSE())=\"est\",\"est\",\"-\")","v":"-"},"Europe",{"v":1,"d":"1.0"},{"$nulls":3},"ITA"]
[{"$f":"'12.lan'!D434","v":"JAM Jamaica"},"Jamaica",{"$f":"VLOOKUP(B117,'12.ppp data'!$C$3:$J$273,7,FALSE())","v":{"v":1.97169594036924,"d":"2.0"}},{"$f":"IF(VLOOKUP(B117,'12.ppp data'!$C$3:$J$273,8,FALSE())=\"est\",\"est\",\"-\")","v":"-"},"Americas",{"v":3.42105263157895,"d":"3.4"},"est",null,null,"JAM"]
[{"$f":"'12.lan'!D435","v":"JOR Jordan"},"Jordan",{"$f":"VLOOKUP(B118,'12.ppp data'!$C$3:$J$273,7,FALSE())","v":{"v":2.49255306504953,"d":"2.5"}},{"$f":"IF(VLOOKUP(B118,'12.ppp data'!$C$3:$J$273,8,FALSE())=\"est\",\"est\",\"-\")","v":"-"},"Asia",{"v":4,"d":"4.0"},{"$nulls":3},"JOR"]
[{"$f":"'12.lan'!D436","v":"JPN Japan"},"Japan",{"$f":"VLOOKUP(B119,'12.ppp data'!$C$3:$J$273,7,FALSE())","v":{"v":1.28940812010188,"d":"1.3"}},{"$f":"IF(VLOOKUP(B119,'12.ppp data'!$C$3:$J$273,8,FALSE())=\"est\",\"est\",\"-\")","v":"-"},"Asia",{"v":2,"d":"2.0"},{"$nulls":3},"JPN"]
[{"$f":"'12.lan'!D437","v":"KAZ Kazakhstan"},"Kazakhstan",{"$f":"VLOOKUP(B120,'12.ppp data'!$C$3:$J$273,7,FALSE())","v":{"v":3.35883151819116,"d":"3.4"}},{"$f":"IF(VLOOKUP(B120,'12.ppp data'!$C$3:$J$273,8,FALSE())=\"est\",\"est\",\"-\")","v":"-"},"Asia",{"v":4.17857142857143,"d":"4.2"},"est",null,null,"KAZ"]
[{"$f":"'12.lan'!D438","v":"KEN Kenya"},"Kenya",{"$f":"VLOOKUP(B121,'12.ppp data'!$C$3:$J$273,7,FALSE())","v":{"v":2.42236258173826,"d":"2.4"}},{"$f":"IF(VLOOKUP(B121,'12.ppp data'!$C$3:$J$273,8,FALSE())=\"est\",\"est\",\"-\")","v":"-"},"Africa",{"v":4,"d":"4.0"},{"$nulls":3},"KEN"]
[{"$f":"'12.lan'!D439","v":"KGZ Kyrgyzstan"},"Kyrgyz Republic",{"$f":"VLOOKUP(B122,'12.ppp data'!$C$3:$J$273,7,FALSE())","v":{"v":3.44949487120571,"d":"3.4"}},{"$f":"IF(VLOOKUP(B122,'12.ppp data'!$C$3:$J$273,8,FALSE())=\"est\",\"est\",\"-\")","v":"-"},"Asia",{"v":4.17857142857143,"d":"4.2"},"est",null,null,"KGZ"]
[{"$f":"'12.lan'!D440","v":"KHM Cambodia"},"Cambodia",{"$f":"VLOOKUP(B123,'12.ppp data'!$C$3:$J$273,7,FALSE())","v":{"v":3.20980973331692,"d":"3.2"}},{"$f":"IF(VLOOKUP(B123,'12.ppp data'!$C$3:$J$273,8,FALSE())=\"est\",\"est\",\"-\")","v":"-"},"Asia",{"v":5,"d":"5.0"},{"$nulls":3},"KHM"]
[{"$f":"'12.lan'!D441","v":"KIR Kiribati"},"Kiribati",{"$f":"VLOOKUP(B124,'12.ppp data'!$C$3:$J$273,7,FALSE())","v":{"v":1.45788861443993,"d":"1.5"}},{"$f":"IF(VLOOKUP(B124,'12.ppp data'!$C$3:$J$273,8,FALSE())=\"est\",\"est\",\"-\")","v":"-"},"Oceania",{"v":3,"d":"3.0"},"est",null,null,"KIR"]
[{"$f":"'12.lan'!D442","v":"KNA Saint Kitts and Nevis"},"St. Kitts and Nevis",{"$f":"VLOOKUP(B125,'12.ppp data'!$C$3:$J$273,7,FALSE())","v":{"v":1.78885652779978,"d":"1.8"}},{"$f":"IF(VLOOKUP(B125,'12.ppp data'!$C$3:$J$273,8,FALSE())=\"est\",\"est\",\"-\")","v":"-"},"Americas",{"v":3.42105263157895,"d":"3.4"},"est",null,null,"KNA"]
[{"$f":"'12.lan'!D443","v":"KOR Korea, Republic of"},"Korea, Rep.",{"$f":"VLOOKUP(B126,'12.ppp data'!$C$3:$J$273,7,FALSE())","v":{"v":1.45065185695947,"d":"1.5"}},{"$f":"IF(VLOOKUP(B126,'12.ppp data'!$C$3:$J$273,8,FALSE())=\"est\",\"est\",\"-\")","v":"-"},"Asia",{"v":5,"d":"5.0"},{"$nulls":3},"KOR"]
[{"$f":"'12.lan'!D444","v":"KWT Kuwait"},"Kuwait",{"$f":"VLOOKUP(B127,'12.ppp data'!$C$3:$J$273,7,FALSE())","v":{"v":2.79361619205596,"d":"2.8"}},{"$f":"IF(VLOOKUP(B127,'12.ppp data'!$C$3:$J$273,8,FALSE())=\"est\",\"est\",\"-\")","v":"-"},"Asia",{"v":4.17857142857143,"d":"4.2"},"est",null,null,"KWT"]
[{"$f":"'12.lan'!D445","v":"LAO Lao People's Democratic Republic"},"Lao PDR",{"$f":"VLOOKUP(B128,'12.ppp data'!$C$3:$J$273,7,FALSE())","v":{"v":3.13226203814786,"d":"3.1"}},{"$f":"IF(VLOOKUP(B128,'12.ppp data'!$C$3:$J$273,8,FALSE())=\"est\",\"est\",\"-\")","v":"-"},"Asia",{"v":4.17857142857143,"d":"4.2"},"est",null,null,"LAO"]
[{"$f":"'12.lan'!D446","v":"LBN Lebanon"},"Lebanon",{"$f":"VLOOKUP(B129,'12.ppp data'!$C$3:$J$273,7,FALSE())","v":{"v":1.91672689697567,"d":"1.9"}},{"$f":"IF(VLOOKUP(B129,'12.ppp data'!$C$3:$J$273,8,FALSE())=\"est\",\"est\",\"-\")","v":"-"},"Asia",{"v":4,"d":"4.0"},{"$nulls":3},"LBN"]
[{"$f":"'12.lan'!D447","v":"LBR Liberia"},"Liberia",{"$f":"VLOOKUP(B130,'12.ppp data'!$C$3:$J$273,7,FALSE())","v":{"v":3.03256163278312,"d":"3.0"}},{"$f":"IF(VLOOKUP(B130,'12.ppp data'!$C$3:$J$273,8,FALSE())=\"est\",\"est\",\"-\")","v":"est"},"Africa",{"v":3.70833333333333,"d":"3.7"},"est",null,null,"LBR"]
[{"$f":"'12.lan'!D448","v":"LBY Libya"},"Libya",{"$f":"VLOOKUP(B131,'12.ppp data'!$C$3:$J$273,7,FALSE())","v":{"v":2.74293617699787,"d":"2.7"}},{"$f":"IF(VLOOKUP(B131,'12.ppp data'!$C$3:$J$273,8,FALSE())=\"est\",\"est\",\"-\")","v":"-"},"Africa",{"v":6,"d":"6.0"},{"$nulls":3},"LBY"]
[{"$f":"'12.lan'!D449","v":"LCA Saint Lucia"},"St. Lucia",{"$f":"VLOOKUP(B132,'12.ppp data'!$C$3:$J$273,7,FALSE())","v":{"v":1.67745760134086,"d":"1.7"}},{"$f":"IF(VLOOKUP(B132,'12.ppp data'!$C$3:$J$273,8,FALSE())=\"est\",\"est\",\"-\")","v":"-"},"Americas",{"v":3.42105263157895,"d":"3.4"},"est",null,null,"LCA"]
[{"$f":"'12.lan'!D450","v":"LIE Liechtenstein"},"Liechtenstein",{"$f":"VLOOKUP(B133,'12.ppp data'!$C$3:$J$273,7,FALSE())","v":{"v":1.93286164519776,"d":"1.9"}},{"$f":"IF(VLOOKUP(B133,'12.ppp data'!$C$3:$J$273,8,FALSE())=\"est\",\"est\",\"-\")","v":"est"},"Europe",{"v":2,"d":"2.0"},"est",null,null,"LIE"]
[{"$f":"'12.lan'!D451","v":"LKA Sri Lanka"},"Sri Lanka",{"$f":"VLOOKUP(B134,'12.ppp data'!$C$3:$J$273,7,FALSE())","v":{"v":3.51536133620754,"d":"3.5"}},{"$f":"IF(VLOOKUP(B134,'12.ppp data'!$C$3:$J$273,8,FALSE())=\"est\",\"est\",\"-\")","v":"-"},"Asia",{"v":3,"d":"3.0"},{"$nulls":3},"LKA"]
[{"$f":"'12.lan'!D452","v":"LSO Lesotho"},"Lesotho",{"$f":"VLOOKUP(B135,'12.ppp data'!$C$3:$J$273,7,FALSE())","v":{"v":2.98381317338922,"d":"3.0"}},{"$f":"IF(VLOOKUP(B135,'12.ppp data'!$C$3:$J$273,8,FALSE())=\"est\",\"est\",\"-\")","v":"-"},"Africa",{"v":3.70833333333333,"d":"3.7"},"est",null,null,"LSO"]
[{"$f":"'12.lan'!D453","v":"LTU Lithuania"},"Lithuania",{"$f":"VLOOKUP(B136,'12.ppp data'!$C$3:$J$273,7,FALSE())","v":{"v":2.16806176709918,"d":"2.2"}},{"$f":"IF(VLOOKUP(B136,'12.ppp data'!$C$3:$J$273,8,FALSE())=\"est\",\"est\",\"-\")","v":"-"},"Europe",{"v":1,"d":"1.0"},{"$nulls":3},"LTU"]
[{"$f":"'12.lan'!D454","v":"LUX Luxembourg"},"Luxembourg",{"$f":"VLOOKUP(B137,'12.ppp data'!$C$3:$J$273,7,FALSE())","v":{"v":1.12211406289449,"d":"1.1"}},{"$f":"IF(VLOOKUP(B137,'12.ppp data'!$C$3:$J$273,8,FALSE())=\"est\",\"est\",\"-\")","v":"-"},"Europe",{"v":2,"d":"2.0"},"est",null,null,"LUX"]
[{"$f":"'12.lan'!D455","v":"LVA Latvia"},"Latvia",{"$f":"VLOOKUP(B138,'12.ppp data'!$C$3:$J$273,7,FALSE())","v":{"v":1.99433968559289,"d":"2.0"}},{"$f":"IF(VLOOKUP(B138,'12.ppp data'!$C$3:$J$273,8,FALSE())=\"est\",\"est\",\"-\")","v":"-"},"Europe",{"v":2,"d":"2.0"},{"$nulls":3},"LVA"]
[{"$f":"'12.lan'!D456","v":"MAC Macao"},"Macao SAR, China",{"$f":"VLOOKUP(B139,'12.ppp data'!$C$3:$J$273,7,FALSE())","v":{"v":1.57323844620917,"d":"1.6"}},{"$f":"IF(VLOOKUP(B139,'12.ppp data'!$C$3:$J$273,8,FALSE())=\"est\",\"est\",\"-\")","v":"-"},"Asia",{"v":4.17857142857143,"d":"4.2"},"est",null,null,"MAC"]
[{"$f":"'12.lan'!D457","v":"MAF Saint Martin (French part)"},"St. Martin (French part)",{"$f":"VLOOKUP(B140,'12.ppp data'!$C$3:$J$273,7,FALSE())","v":{"v":1.96289944979353,"d":"2.0"}},{"$f":"IF(VLOOKUP(B140,'12.ppp data'!$C$3:$J$273,8,FALSE())=\"est\",\"est\",\"-\")","v":"est"},"Americas",{"v":3.42105263157895,"d":"3.4"},"est",null,null,"MAF"]
[{"$f":"'12.lan'!D458","v":"MAR Morocco"},"Morocco",{"$f":"VLOOKUP(B141,'12.ppp data'!$C$3:$J$273,7,FALSE())","v":{"v":3.050702034376,"d":"3.1"}},{"$f":"IF(VLOOKUP(B141,'12.ppp data'!$C$3:$J$273,8,FALSE())=\"est\",\"est\",\"-\")","v":"-"},"Africa",{"v":4,"d":"4.0"},{"$nulls":3},"MAR"]
[{"$f":"'12.lan'!D459","v":"MCO Monaco"},"Monaco",{"$f":"VLOOKUP(B142,'12.ppp data'!$C$3:$J$273,7,FALSE())","v":{"v":1.93286164519776,"d":"1.9"}},{"$f":"IF(VLOOKUP(B142,'12.ppp data'!$C$3:$J$273,8,FALSE())=\"est\",\"est\",\"-\")","v":"est"},"Europe",{"v":2,"d":"2.0"},"est",null,null,"MCO"]
[{"$f":"'12.lan'!D460","v":"MDA Moldova, Republic of"},"Moldova",{"$f":"VLOOKUP(B143,'12.ppp data'!$C$3:$J$273,7,FALSE())","v":{"v":2.76701051372199,"d":"2.8"}},{"$f":"IF(VLOOKUP(B143,'12.ppp data'!$C$3:$J$273,8,FALSE())=\"est\",\"est\",\"-\")","v":"-"},"Europe",{"v":2,"d":"2.0"},"est",null,null,"MDA"]
[{"$f":"'12.lan'!D461","v":"MDG Madagascar"},"Madagascar",{"$f":"VLOOKUP(B144,'12.ppp data'!$C$3:$J$273,7,FALSE())","v":{"v":3.86377770315813,"d":"3.9"}},{"$f":"IF(VLOOKUP(B144,'12.ppp data'!$C$3:$J$273,8,FALSE())=\"est\",\"est\",\"-\")","v":"-"},"Africa",{"v":3.70833333333333,"d":"3.7"},"est",null,null,"MDG"]
[{"$f":"'12.lan'!D462","v":"MDV Maldives"},"Maldives",{"$f":"VLOOKUP(B145,'12.ppp data'!$C$3:$J$273,7,FALSE())","v":{"v":1.77113251397802,"d":"1.8"}},{"$f":"IF(VLOOKUP(B145,'12.ppp data'!$C$3:$J$273,8,FALSE())=\"est\",\"est\",\"-\")","v":"-"},"Asia",{"v":4.17857142857143,"d":"4.2"},"est",null,null,"MDV"]
[{"$f":"'12.lan'!D463","v":"MEX Mexico"},"Mexico",{"$f":"VLOOKUP(B146,'12.ppp data'!$C$3:$J$273,7,FALSE())","v":{"v":2.29945331128235,"d":"2.3"}},{"$f":"IF(VLOOKUP(B146,'12.ppp data'!$C$3:$J$273,8,FALSE())=\"est\",\"est\",\"-\")","v":"-"},"Americas",{"v":4,"d":"4.0"},{"$nulls":3},"MEX"]
[{"$f":"'12.lan'!D464","v":"MHL Marshall Islands"},"Marshall Islands",{"$f":"VLOOKUP(B147,'12.ppp data'!$C$3:$J$273,7,FALSE())","v":{"v":1.26180337538196,"d":"1.3"}},{"$f":"IF(VLOOKUP(B147,'12.ppp data'!$C$3:$J$273,8,FALSE())=\"est\",\"est\",\"-\")","v":"-"},"Oceania",{"v":3,"d":"3.0"},"est",null,null,"MHL"]
[{"$f":"'12.lan'!D465","v":"MKD Macedonia, The Former Yugoslav Republic of"},"Macedonia, FYR",{"$f":"VLOOKUP(B148,'12.ppp data'!$C$3:$J$273,7,FALSE())","v":{"v":3.1366359337907,"d":"3.1"}},{"$f":"IF(VLOOKUP(B148,'12.ppp data'!$C$3:$J$273,8,FALSE())=\"est\",\"est\",\"-\")","v":"-"},"Europe",{"v":2,"d":"2.0"},"est",null,null,"MKD"]
[{"$f":"'12.lan'!D466","v":"MLI Mali"},"Mali",{"$f":"VLOOKUP(B149,'12.ppp data'!$C$3:$J$273,7,FALSE())","v":{"v":3.02666970174571,"d":"3.0"}},{"$f":"IF(VLOOKUP(B149,'12.ppp data'!$C$3:$J$273,8,FALSE())=\"est\",\"est\",\"-\")","v":"-"},"Africa",{"v":3.70833333333333,"d":"3.7"},"est",null,null,"MLI"]
[{"$f":"'12.lan'!D467","v":"MLT Malta"},"Malta",{"$f":"VLOOKUP(B150,'12.ppp data'!$C$3:$J$273,7,FALSE())","v":{"v":0.711088927927647,"d":"0.7"}},{"$f":"IF(VLOOKUP(B150,'12.ppp data'!$C$3:$J$273,8,FALSE())=\"est\",\"est\",\"-\")","v":"-"},"Europe",{"v":2,"d":"2.0"},"est",null,null,"MLT"]
[{"$f":"'12.lan'!D468","v":"MMR Myanmar"},"Myanmar",{"$f":"VLOOKUP(B151,'12.ppp data'!$C$3:$J$273,7,FALSE())","v":{"v":5.31553582294189,"d":"5.3"}},{"$f":"IF(VLOOKUP(B151,'12.ppp data'!$C$3:$J$273,8,FALSE())=\"est\",\"est\",\"-\")","v":"-"},"Asia",{"v":4,"d":"4.0"},{"$nulls":3},"MMR"]
[{"$f":"'12.lan'!D469","v":"MNE Montenegro"},"Montenegro",{"$f":"VLOOKUP(B152,'12.ppp data'!$C$3:$J$273,7,FALSE())","v":{"v":2.75715047790181,"d":"2.8"}},{"$f":"IF(VLOOKUP(B152,'12.ppp data'!$C$3:$J$273,8,FALSE())=\"est\",\"est\",\"-\")","v":"-"},"Europe",{"v":2,"d":"2.0"},"est",null,null,"MNE"]
[{"$f":"'12.lan'!D470","v":"MNG Mongolia"},"Mongolia",{"$f":"VLOOKUP(B153,'12.ppp data'!$C$3:$J$273,7,FALSE())","v":{"v":3.91683564767957,"d":"3.9"}},{"$f":"IF(VLOOKUP(B153,'12.ppp data'!$C$3:$J$273,8,FALSE())=\"est\",\"est\",\"-\")","v":"-"},"Asia",{"v":4.17857142857143,"d":"4.2"},"est",null,null,"MNG"]
[{"$f":"'12.lan'!D471","v":"MNP Northern Mariana Islands"},"Northern Mariana Islands",{"$f":"VLOOKUP(B154,'12.ppp data'!$C$3:$J$273,7,FALSE())","v":{"v":1.35633083709363,"d":"1.4"}},{"$f":"IF(VLOOKUP(B154,'12.ppp data'!$C$3:$J$273,8,FALSE())=\"est\",\"est\",\"-\")","v":"est"},"Oceania",{"v":3,"d":"3.0"},"est",null,null,"MNP"]
[{"$f":"'12.lan'!D472","v":"MOZ Mozambique"},"Mozambique",{"$f":"VLOOKUP(B155,'12.ppp data'!$C$3:$J$273,7,FALSE())","v":{"v":3.40668986891956,"d":"3.4"}},{"$f":"IF(VLOOKUP(B155,'12.ppp data'!$C$3:$J$273,8,FALSE())=\"est\",\"est\",\"-\")","v":"-"},"Africa",{"v":3,"d":"3.0"},{"$nulls":3},"MOZ"]
[{"$f":"'12.lan'!D473","v":"MRT Mauritania"},"Mauritania",{"$f":"VLOOKUP(B156,'12.ppp data'!$C$3:$J$273,7,FALSE())","v":{"v":3.89285474896845,"d":"3.9"}},{"$f":"IF(VLOOKUP(B156,'12.ppp data'!$C$3:$J$273,8,FALSE())=\"est\",\"est\",\"-\")","v":"-"},"Africa",{"v":3.70833333333333,"d":"3.7"},"est",null,null,"MRT"]
[{"$f":"'12.lan'!D474","v":"MUS Mauritius"},"Mauritius",{"$f":"VLOOKUP(B157,'12.ppp data'!$C$3:$J$273,7,FALSE())","v":{"v":2.30108226965678,"d":"2.3"}},{"$f":"IF(VLOOKUP(B157,'12.ppp data'!$C$3:$J$273,8,FALSE())=\"est\",\"est\",\"-\")","v":"-"},"Africa",{"v":3.70833333333333,"d":"3.7"},"est",null,null,"MUS"]
[{"$f":"'12.lan'!D475","v":"MWI Malawi"},"Malawi",{"$f":"VLOOKUP(B158,'12.ppp data'!$C$3:$J$273,7,FALSE())","v":{"v":3.94934736358746,"d":"3.9"}},{"$f":"IF(VLOOKUP(B158,'12.ppp data'!$C$3:$J$273,8,FALSE())=\"est\",\"est\",\"-\")","v":"-"},"Africa",{"v":3.70833333333333,"d":"3.7"},"est",null,null,"MWI"]
[{"$f":"'12.lan'!D476","v":"MYS Malaysia"},"Malaysia",{"$f":"VLOOKUP(B159,'12.ppp data'!$C$3:$J$273,7,FALSE())","v":{"v":3.34095390869308,"d":"3.3"}},{"$f":"IF(VLOOKUP(B159,'12.ppp data'!$C$3:$J$273,8,FALSE())=\"est\",\"est\",\"-\")","v":"-"},"Asia",{"v":5,"d":"5.0"},{"$nulls":3},"MYS"]
[{"$f":"'12.lan'!D477","v":"NAM Namibia"},"Namibia",{"$f":"VLOOKUP(B160,'12.ppp data'!$C$3:$J$273,7,FALSE())","v":{"v":2.26122272509832,"d":"2.3"}},{"$f":"IF(VLOOKUP(B160,'12.ppp data'!$C$3:$J$273,8,FALSE())=\"est\",\"est\",\"-\")","v":"-"},"Africa",{"v":3,"d":"3.0"},{"$nulls":3},"NAM"]
[{"$f":"'12.lan'!D478","v":"NCL New Caledonia"},"New Caledonia",{"$f":"VLOOKUP(B161,'12.ppp data'!$C$3:$J$273,7,FALSE())","v":{"v":1.35633083709363,"d":"1.4"}},{"$f":"IF(VLOOKUP(B161,'12.ppp data'!$C$3:$J$273,8,FALSE())=\"est\",\"est\",\"-\")","v":"est"},"Oceania",{"v":3,"d":"3.0"},"est",null,null,"NCL"]
[{"$f":"'12.lan'!D479","v":"NER Niger"},"Niger",{"$f":"VLOOKUP(B162,'12.ppp data'!$C$3:$J$273,7,FALSE())","v":{"v":3.03451175828867,"d":"3.0"}},{"$f":"IF(VLOOKUP(B162,'12.ppp data'!$C$3:$J$273,8,FALSE())=\"est\",\"est\",\"-\")","v":"-"},"Africa",{"v":3.70833333333333,"d":"3.7"},"est",null,null,"NER"]
[{"$f":"'12.lan'!D480","v":"NGA Nigeria"},"Nigeria",{"$f":"VLOOKUP(B163,'12.ppp data'!$C$3:$J$273,7,FALSE())","v":{"v":3.64733163441153,"d":"3.6"}},{"$f":"IF(VLOOKUP(B163,'12.ppp data'!$C$3:$J$273,8,FALSE())=\"est\",\"est\",\"-\")","v":"-"},"Africa",{"v":5,"d":"5.0"},{"$nulls":3},"NGA"]
[{"$f":"'12.lan'!D481","v":"NIC Nicaragua"},"Nicaragua",{"$f":"VLOOKUP(B164,'12.ppp data'!$C$3:$J$273,7,FALSE())","v":{"v":2.92370990416819,"d":"2.9"}},{"$f":"IF(VLOOKUP(B164,'12.ppp data'!$C$3:$J$273,8,FALSE())=\"est\",\"est\",\"-\")","v":"-"},"Americas",{"v":3.42105263157895,"d":"3.4"},"est",null,null,"NIC"]
[{"$f":"'12.lan'!D482","v":"NLD Netherlands"},"Netherlands",{"$f":"VLOOKUP(B165,'12.ppp data'!$C$3:$J$273,7,FALSE())","v":{"v":1.23714146094035,"d":"1.2"}},{"$f":"IF(VLOOKUP(B165,'12.ppp data'!$C$3:$J$273,8,FALSE())=\"est\",\"est\",\"-\")","v":"-"},"Europe",{"v":1,"d":"1.0"},{"$nulls":3},"NLD"]
[{"$f":"'12.lan'!D483","v":"NOR Norway"},"Norway",{"$f":"VLOOKUP(B166,'12.ppp data'!$C$3:$J$273,7,FALSE())","v":{"v":0.91144613113908,"d":"0.9"}},{"$f":"IF(VLOOKUP(B166,'12.ppp data'!$C$3:$J$273,8,FALSE())=\"est\",\"est\",\"-\")","v":"-"},"Europe",{"v":1,"d":"1.0"},{"$nulls":3},"NOR"]
[{"$f":"'12.lan'!D484","v":"NPL Nepal"},"Nepal",{"$f":"VLOOKUP(B167,'12.ppp data'!$C$3:$J$273,7,FALSE())","v":{"v":3.5079000577966,"d":"3.5"}},{"$f":"IF(VLOOKUP(B167,'12.ppp data'!$C$3:$J$273,8,FALSE())=\"est\",\"est\",\"-\")","v":"-"},"Asia",{"v":4,"d":"4.0"},{"$nulls":3},"NPL"]
[{"$f":"'12.lan'!D485","v":"NRU Nauru"},"Nauru",{"$f":"VLOOKUP(B168,'12.ppp data'!$C$3:$J$273,7,FALSE())","v":{"v":1.88609880733593,"d":"1.9"}},{"$f":"IF(VLOOKUP(B168,'12.ppp data'!$C$3:$J$273,8,FALSE())=\"est\",\"est\",\"-\")","v":"-"},"Oceania",{"v":3,"d":"3.0"},"est",null,null,"NRU"]
[{"$f":"'12.lan'!D486","v":"NZL New Zealand"},"New Zealand",{"$f":"VLOOKUP(B169,'12.ppp data'!$C$3:$J$273,7,FALSE())","v":{"v":1.07607874212516,"d":"1.1"}},{"$f":"IF(VLOOKUP(B169,'12.ppp data'!$C$3:$J$273,8,FALSE())=\"est\",\"est\",\"-\")","v":"-"},"Oceania",{"v":3,"d":"3.0"},"est",null,null,"NZL"]
[{"$f":"'12.lan'!D487","v":"OMN Oman"},"Oman",{"$f":"VLOOKUP(B170,'12.ppp data'!$C$3:$J$273,7,FALSE())","v":{"v":2.99894922477162,"d":"3.0"}},{"$f":"IF(VLOOKUP(B170,'12.ppp data'!$C$3:$J$273,8,FALSE())=\"est\",\"est\",\"-\")","v":"-"},"Asia",{"v":4,"d":"4.0"},{"$nulls":3},"OMN"]
[{"$f":"'12.lan'!D488","v":"PAK Pakistan"},"Pakistan",{"$f":"VLOOKUP(B171,'12.ppp data'!$C$3:$J$273,7,FALSE())","v":{"v":4.01618180859595,"d":"4.0"}},{"$f":"IF(VLOOKUP(B171,'12.ppp data'!$C$3:$J$273,8,FALSE())=\"est\",\"est\",\"-\")","v":"-"},"Asia",{"v":4,"d":"4.0"},{"$nulls":3},"PAK"]
[{"$f":"'12.lan'!D489","v":"PAN Panama"},"Panama",{"$f":"VLOOKUP(B172,'12.ppp data'!$C$3:$J$273,7,FALSE())","v":{"v":1.83006779906169,"d":"1.8"}},{"$f":"IF(VLOOKUP(B172,'12.ppp data'!$C$3:$J$273,8,FALSE())=\"est\",\"est\",\"-\")","v":"-"},"Americas",{"v":4,"d":"4.0"},{"$nulls":3},"PAN"]
[{"$f":"'12.lan'!D490","v":"PER Peru"},"Peru",{"$f":"VLOOKUP(B173,'12.ppp data'!$C$3:$J$273,7,FALSE())","v":{"v":2.28216515379713,"d":"2.3"}},{"$f":"IF(VLOOKUP(B173,'12.ppp data'!$C$3:$J$273,8,FALSE())=\"est\",\"est\",\"-\")","v":"-"},"Americas",{"v":4,"d":"4.0"},{"$nulls":3},"PER"]
[{"$f":"'12.lan'!D491","v":"PHL Philippines"},"Philippines",{"$f":"VLOOKUP(B174,'12.ppp data'!$C$3:$J$273,7,FALSE())","v":{"v":3.14769869498838,"d":"3.1"}},{"$f":"IF(VLOOKUP(B174,'12.ppp data'!$C$3:$J$273,8,FALSE())=\"est\",\"est\",\"-\")","v":"-"},"Asia",{"v":5,"d":"5.0"},{"$nulls":3},"PHL"]
[{"$f":"'12.lan'!D492","v":"PLW Palau"},"Palau",{"$f":"VLOOKUP(B175,'12.ppp data'!$C$3:$J$273,7,FALSE())","v":{"v":1.22366830689442,"d":"1.2"}},{"$f":"IF(VLOOKUP(B175,'12.ppp data'!$C$3:$J$273,8,FALSE())=\"est\",\"est\",\"-\")","v":"-"},"Oceania",{"v":3,"d":"3.0"},"est",null,null,"PLW"]
[{"$f":"'12.lan'!D493","v":"PNG Papua New Guinea"},"Papua New Guinea",{"$f":"VLOOKUP(B176,'12.ppp data'!$C$3:$J$273,7,FALSE())","v":{"v":1.81785765698532,"d":"1.8"}},{"$f":"IF(VLOOKUP(B176,'12.ppp data'!$C$3:$J$273,8,FALSE())=\"est\",\"est\",\"-\")","v":"-"},"Oceania",{"v":3,"d":"3.0"},"est",null,null,"PNG"]
[{"$f":"'12.lan'!D494","v":"POL Poland"},"Poland",{"$f":"VLOOKUP(B177,'12.ppp data'!$C$3:$J$273,7,FALSE())","v":{"v":2.39207920980538,"d":"2.4"}},{"$f":"IF(VLOOKUP(B177,'12.ppp data'!$C$3:$J$273,8,FALSE())=\"est\",\"est\",\"-\")","v":"-"},"Europe",{"v":3,"d":"3.0"},{"$nulls":3},"POL"]
[{"$f":"'12.lan'!D495","v":"PRI Puerto Rico"},"Puerto Rico",{"$f":"VLOOKUP(B178,'12.ppp data'!$C$3:$J$273,7,FALSE())","v":{"v":1.96289944979353,"d":"2.0"}},{"$f":"IF(VLOOKUP(B178,'12.ppp data'!$C$3:$J$273,8,FALSE())=\"est\",\"est\",\"-\")","v":"est"},"Americas",{"v":3.42105263157895,"d":"3.4"},"est",null,null,"PRI"]
[{"$f":"'12.lan'!D496","v":"PRK Korea, Democratic People's Republic of"},"Korea, Dem. People’s Rep.",{"$f":"VLOOKUP(B179,'12.ppp data'!$C$3:$J$273,7,FALSE())","v":{"v":3.00272943672245,"d":"3.0"}},{"$f":"IF(VLOOKUP(B179,'12.ppp data'!$C$3:$J$273,8,FALSE())=\"est\",\"est\",\"-\")","v":"est"},"Asia",{"v":4.17857142857143,"d":"4.2"},"est",null,null,"PRK"]
[{"$f":"'12.lan'!D497","v":"PRT Portugal"},"Portugal",{"$f":"VLOOKUP(B180,'12.ppp data'!$C$3:$J$273,7,FALSE())","v":{"v":1.71669399071269,"d":"1.7"}},{"$f":"IF(VLOOKUP(B180,'12.ppp data'!$C$3:$J$273,8,FALSE())=\"est\",\"est\",\"-\")","v":"-"},"Europe",{"v":3,"d":"3.0"},{"$nulls":3},"PRT"]
[{"$f":"'12.lan'!D498","v":"PRY Paraguay"},"Paraguay",{"$f":"VLOOKUP(B181,'12.ppp data'!$C$3:$J$273,7,FALSE())","v":{"v":2.48547766885933,"d":"2.5"}},{"$f":"IF(VLOOKUP(B181,'12.ppp data'!$C$3:$J$273,8,FALSE())=\"est\",\"est\",\"-\")","v":"-"},"Americas",{"v":3,"d":"3.0"},{"$nulls":3},"PRY"]
[{"$f":"'12.lan'!D499","v":"PSE Palestinian Territory, Occupied"},"West Bank and Gaza",{"$f":"VLOOKUP(B182,'12.ppp data'!$C$3:$J$273,7,FALSE())","v":{"v":3.00272943672245,"d":"3.0"}},{"$f":"IF(VLOOKUP(B182,'12.ppp data'!$C$3:$J$273,8,FALSE())=\"est\",\"est\",\"-\")","v":"est"},"Asia",{"v":4.17857142857143,"d":"4.2"},"est",null,null,"PSE"]
[{"$f":"'12.lan'!D500","v":"PYF French Polynesia"},"French Polynesia",{"$f":"VLOOKUP(B183,'12.ppp data'!$C$3:$J$273,7,FALSE())","v":{"v":1.35633083709363,"d":"1.4"}},{"$f":"IF(VLOOKUP(B183,'12.ppp data'!$C$3:$J$273,8,FALSE())=\"est\",\"est\",\"-\")","v":"est"},"Oceania",{"v":3,"d":"3.0"},"est",null,null,"PYF"]
[{"$f":"'12.lan'!D501","v":"QAT Qatar"},"Qatar",{"$f":"VLOOKUP(B184,'12.ppp data'!$C$3:$J$273,7,FALSE())","v":{"v":2.27544019899822,"d":"2.3"}},{"$f":"IF(VLOOKUP(B184,'12.ppp data'!$C$3:$J$273,8,FALSE())=\"est\",\"est\",\"-\")","v":"-"},"Asia",{"v":5,"d":"5.0"},{"$nulls":3},"QAT"]
[{"$f":"'12.lan'!D502","v":"ROU Romania"},"Romania",{"$f":"VLOOKUP(B185,'12.ppp data'!$C$3:$J$273,7,FALSE())","v":{"v":2.69557227475973,"d":"2.7"}},{"$f":"IF(VLOOKUP(B185,'12.ppp data'!$C$3:$J$273,8,FALSE())=\"est\",\"est\",\"-\")","v":"-"},"Europe",{"v":3,"d":"3.0"},{"$nulls":3},"ROU"]
[{"$f":"'12.lan'!D503","v":"RUS Russian Federation"},"Russian Federation",{"$f":"VLOOKUP(B186,'12.ppp data'!$C$3:$J$273,7,FALSE())","v":{"v":2.68212657801862,"d":"2.7"}},{"$f":"IF(VLOOKUP(B186,'12.ppp data'!$C$3:$J$273,8,FALSE())=\"est\",\"est\",\"-\")","v":"-"},"Europe",{"v":2,"d":"2.0"},{"$nulls":3},"RUS"]
[{"$f":"'12.lan'!D504","v":"RWA Rwanda"},"Rwanda",{"$f":"VLOOKUP(B187,'12.ppp data'!$C$3:$J$273,7,FALSE())","v":{"v":3.04228722120981,"d":"3.0"}},{"$f":"IF(VLOOKUP(B187,'12.ppp data'!$C$3:$J$273,8,FALSE())=\"est\",\"est\",\"-\")","v":"-"},"Africa",{"v":3.70833333333333,"d":"3.7"},"est",null,null,"RWA"]
[{"$f":"'12.lan'!D505","v":"SAU Saudi Arabia"},"Saudi Arabia",{"$f":"VLOOKUP(B188,'12.ppp data'!$C$3:$J$273,7,FALSE())","v":{"v":2.92773276934852,"d":"2.9"}},{"$f":"IF(VLOOKUP(B188,'12.ppp data'!$C$3:$J$273,8,FALSE())=\"est\",\"est\",\"-\")","v":"-"},"Asia",{"v":5,"d":"5.0"},{"$nulls":3},"SAU"]
[{"$f":"'12.lan'!D506","v":"SDN Sudan"},"Sudan",{"$f":"VLOOKUP(B189,'12.ppp data'!$C$3:$J$273,7,FALSE())","v":{"v":1.80343208624182,"d":"1.8"}},{"$f":"IF(VLOOKUP(B189,'12.ppp data'!$C$3:$J$273,8,FALSE())=\"est\",\"est\",\"-\")","v":"-"},"Africa",{"v":6,"d":"6.0"},{"$nulls":3},"SDN"]
[{"$f":"'12.lan'!D507","v":"SEN Senegal"},"Senegal",{"$f":"VLOOKUP(B190,'12.ppp data'!$C$3:$J$273,7,FALSE())","v":{"v":2.96283833559755,"d":"3.0"}},{"$f":"IF(VLOOKUP(B190,'12.ppp data'!$C$3:$J$273,8,FALSE())=\"est\",\"est\",\"-\")","v":"-"},"Africa",{"v":2,"d":"2.0"},{"$nulls":3},"SEN"]
[{"$f":"'12.lan'!D508","v":"SGP Singapore"},"Singapore",{"$f":"VLOOKUP(B191,'12.ppp data'!$C$3:$J$273,7,FALSE())","v":{"v":1.83748419171245,"d":"1.8"}},{"$f":"IF(VLOOKUP(B191,'12.ppp data'!$C$3:$J$273,8,FALSE())=\"est\",\"est\",\"-\")","v":"-"},"Asia",{"v":3,"d":"3.0"},{"$nulls":3},"SGP"]
[{"$f":"'12.lan'!D509","v":"SLB Solomon Islands"},"Solomon Islands",{"$f":"VLOOKUP(B192,'12.ppp data'!$C$3:$J$273,7,FALSE())","v":{"v":1.24379365535015,"d":"1.2"}},{"$f":"IF(VLOOKUP(B192,'12.ppp data'!$C$3:$J$273,8,FALSE())=\"est\",\"est\",\"-\")","v":"-"},"Oceania",{"v":3,"d":"3.0"},"est",null,null,"SLB"]
[{"$f":"'12.lan'!D510","v":"SLE Sierra Leone"},"Sierra Leone",{"$f":"VLOOKUP(B193,'12.ppp data'!$C$3:$J$273,7,FALSE())","v":{"v":3.51807415921038,"d":"3.5"}},{"$f":"IF(VLOOKUP(B193,'12.ppp data'!$C$3:$J$273,8,FALSE())=\"est\",\"est\",\"-\")","v":"-"},"Africa",{"v":3.70833333333333,"d":"3.7"},"est",null,null,"SLE"]
[{"$f":"'12.lan'!D511","v":"SLV El Salvador"},"El Salvador",{"$f":"VLOOKUP(B194,'12.ppp data'!$C$3:$J$273,7,FALSE())","v":{"v":2.32503109548962,"d":"2.3"}},{"$f":"IF(VLOOKUP(B194,'12.ppp data'!$C$3:$J$273,8,FALSE())=\"est\",\"est\",\"-\")","v":"-"},"Americas",{"v":4,"d":"4.0"},{"$nulls":3},"SLV"]
[{"$f":"'12.lan'!D512","v":"SMR San Marino"},"San Marino",{"$f":"VLOOKUP(B195,'12.ppp data'!$C$3:$J$273,7,FALSE())","v":{"v":1.41645118186608,"d":"1.4"}},{"$f":"IF(VLOOKUP(B195,'12.ppp data'!$C$3:$J$273,8,FALSE())=\"est\",\"est\",\"-\")","v":"-"},"Europe",{"v":2,"d":"2.0"},"est",null,null,"SMR"]
[{"$f":"'12.lan'!D513","v":"SOM Somalia"},"Somalia",{"$f":"VLOOKUP(B196,'12.ppp data'!$C$3:$J$273,7,FALSE())","v":{"v":3.03256163278312,"d":"3.0"}},{"$f":"IF(VLOOKUP(B196,'12.ppp data'!$C$3:$J$273,8,FALSE())=\"est\",\"est\",\"-\")","v":"est"},"Africa",{"v":3.70833333333333,"d":"3.7"},"est",null,null,"SOM"]
[{"$f":"'12.lan'!D514","v":"SRB Serbia"},"Serbia",{"$f":"VLOOKUP(B197,'12.ppp data'!$C$3:$J$273,7,FALSE())","v":{"v":2.87918793467832,"d":"2.9"}},{"$f":"IF(VLOOKUP(B197,'12.ppp data'!$C$3:$J$273,8,FALSE())=\"est\",\"est\",\"-\")","v":"-"},"Europe",{"v":2,"d":"2.0"},{"$nulls":3},"SRB"]
[{"$f":"'12.lan'!D515","v":"SSD South Sudan"},"South Sudan",{"$f":"VLOOKUP(B198,'12.ppp data'!$C$3:$J$273,7,FALSE())","v":{"v":3.03256163278312,"d":"3.0"}},{"$f":"IF(VLOOKUP(B198,'12.ppp data'!$C$3:$J$273,8,FALSE())=\"est\",\"est\",\"-\")","v":"est"},"Africa",{"v":3.70833333333333,"d":"3.7"},"est",null,null,"SSD"]
[{"$f":"'12.lan'!D516","v":"STP Sao Tome and Principe"},"Sao Tome and Principe",{"$f":"VLOOKUP(B199,'12.ppp data'!$C$3:$J$273,7,FALSE())","v":{"v":3.03256163278312,"d":"3.0"}},{"$f":"IF(VLOOKUP(B199,'12.ppp data'!$C$3:$J$273,8,FALSE())=\"est\",\"est\",\"-\")","v":"est"},"Africa",{"v":3.70833333333333,"d":"3.7"},"est",null,null,"STP"]
[{"$f":"'12.lan'!D517","v":"SUR Suriname"},"Suriname",{"$f":"VLOOKUP(B200,'12.ppp data'!$C$3:$J$273,7,FALSE())","v":{"v":2.86873392034463,"d":"2.9"}},{"$f":"IF(VLOOKUP(B200,'12.ppp data'!$C$3:$J$273,8,FALSE())=\"est\",\"est\",\"-\")","v":"-"},"Americas",{"v":3.42105263157895,"d":"3.4"},"est",null,null,"SUR"]
[{"$f":"'12.lan'!D518","v":"SVK Slovakia"},"Slovak Republic",{"$f":"VLOOKUP(B201,'12.ppp data'!$C$3:$J$273,7,FALSE())","v":{"v":2.05538861232493,"d":"2.1"}},{"$f":"IF(VLOOKUP(B201,'12.ppp data'!$C$3:$J$273,8,FALSE())=\"est\",\"est\",\"-\")","v":"-"},"Europe",{"v":1,"d":"1.0"},{"$nulls":3},"SVK"]
[{"$f":"'12.lan'!D519","v":"SVN Slovenia"},"Slovenia",{"$f":"VLOOKUP(B202,'12.ppp data'!$C$3:$J$273,7,FALSE())","v":{"v":1.66195502417314,"d":"1.7"}},{"$f":"IF(VLOOKUP(B202,'12.ppp data'!$C$3:$J$273,8,FALSE())=\"est\",\"est\",\"-\")","v":"-"},"Europe",{"v":1,"d":"1.0"},{"$nulls":3},"SVN"]
[{"$f":"'12.lan'!D520","v":"SWE Sweden"},"Sweden",{"$f":"VLOOKUP(B203,'12.ppp data'!$C$3:$J$273,7,FALSE())","v":{"v":1.05723642324011,"d":"1.1"}},{"$f":"IF(VLOOKUP(B203,'12.ppp data'!$C$3:$J$273,8,FALSE())=\"est\",\"est\",\"-\")","v":"-"},"Europe",{"v":1,"d":"1.0"},{"$nulls":3},"SWE"]
[{"$f":"'12.lan'!D521","v":"SWZ Swaziland"},"Swaziland",{"$f":"VLOOKUP(B204,'12.ppp data'!$C$3:$J$273,7,FALSE())","v":{"v":2.9684852436677,"d":"3.0"}},{"$f":"IF(VLOOKUP(B204,'12.ppp data'!$C$3:$J$273,8,FALSE())=\"est\",\"est\",\"-\")","v":"-"},"Africa",{"v":3.70833333333333,"d":"3.7"},"est",null,null,"SWZ"]
[{"$f":"'12.lan'!D522","v":"SXM Sint Maarten (Dutch part)"},"Sint Maarten (Dutch part)",{"$f":"VLOOKUP(B205,'12.ppp data'!$C$3:$J$273,7,FALSE())","v":{"v":1.96289944979353,"d":"2.0"}},{"$f":"IF(VLOOKUP(B205,'12.ppp data'!$C$3:$J$273,8,FALSE())=\"est\",\"est\",\"-\")","v":"est"},"Americas",{"v":3.42105263157895,"d":"3.4"},"est",null,null,"SXM"]
[{"$f":"'12.lan'!D523","v":"SYC Seychelles"},"Seychelles",{"$f":"VLOOKUP(B206,'12.ppp data'!$C$3:$J$273,7,FALSE())","v":{"v":1.96703404516381,"d":"2.0"}},{"$f":"IF(VLOOKUP(B206,'12.ppp data'!$C$3:$J$273,8,FALSE())=\"est\",\"est\",\"-\")","v":"-"},"Africa",{"v":3.70833333333333,"d":"3.7"},"est",null,null,"SYC"]
[{"$f":"'12.lan'!D524","v":"SYR Syrian Arab Republic"},"Syrian Arab Republic",{"$f":"VLOOKUP(B207,'12.ppp data'!$C$3:$J$273,7,FALSE())","v":{"v":3.00272943672245,"d":"3.0"}},{"$f":"IF(VLOOKUP(B207,'12.ppp data'!$C$3:$J$273,8,FALSE())=\"est\",\"est\",\"-\")","v":"est"},"Asia",{"v":4.17857142857143,"d":"4.2"},"est",null,null,"SYR"]
[{"$f":"'12.lan'!D525","v":"TCA Turks and Caicos Islands"},"Turks and Caicos Islands",{"$f":"VLOOKUP(B208,'12.ppp data'!$C$3:$J$273,7,FALSE())","v":{"v":1.96289944979353,"d":"2.0"}},{"$f":"IF(VLOOKUP(B208,'12.ppp data'!$C$3:$J$273,8,FALSE())=\"est\",\"est\",\"-\")","v":"est"},"Americas",{"v":3.42105263157895,"d":"3.4"},"est",null,null,"TCA"]
[{"$f":"'12.lan'!D526","v":"TCD Chad"},"Chad",{"$f":"VLOOKUP(B209,'12.ppp data'!$C$3:$J$273,7,FALSE())","v":{"v":3.27192380698926,"d":"3.3"}},{"$f":"IF(VLOOKUP(B209,'12.ppp data'!$C$3:$J$273,8,FALSE())=\"est\",\"est\",\"-\")","v":"-"},"Africa",{"v":3,"d":"3.0"},{"$nulls":3},"TCD"]
[{"$f":"'12.lan'!D527","v":"TGO Togo"},"Togo",{"$f":"VLOOKUP(B210,'12.ppp data'!$C$3:$J$273,7,FALSE())","v":{"v":2.870177332468,"d":"2.9"}},{"$f":"IF(VLOOKUP(B210,'12.ppp data'!$C$3:$J$273,8,FALSE())=\"est\",\"est\",\"-\")","v":"-"},"Africa",{"v":3.70833333333333,"d":"3.7"},"est",null,null,"TGO"]
[{"$f":"'12.lan'!D528","v":"THA Thailand"},"Thailand",{"$f":"VLOOKUP(B211,'12.ppp data'!$C$3:$J$273,7,FALSE())","v":{"v":3.0545723851266,"d":"3.1"}},{"$f":"IF(VLOOKUP(B211,'12.ppp data'!$C$3:$J$273,8,FALSE())=\"est\",\"est\",\"-\")","v":"-"},"Asia",{"v":4,"d":"4.0"},{"$nulls":3},"THA"]
[{"$f":"'12.lan'!D529","v":"TJK Tajikistan"},"Tajikistan",{"$f":"VLOOKUP(B212,'12.ppp data'!$C$3:$J$273,7,FALSE())","v":{"v":4.45444809050921,"d":"4.5"}},{"$f":"IF(VLOOKUP(B212,'12.ppp data'!$C$3:$J$273,8,FALSE())=\"est\",\"est\",\"-\")","v":"-"},"Asia",{"v":4.17857142857143,"d":"4.2"},"est",null,null,"TJK"]
[{"$f":"'12.lan'!D530","v":"TKM Turkmenistan"},"Turkmenistan",{"$f":"VLOOKUP(B213,'12.ppp data'!$C$3:$J$273,7,FALSE())","v":{"v":2.69286416638208,"d":"2.7"}},{"$f":"IF(VLOOKUP(B213,'12.ppp data'!$C$3:$J$273,8,FALSE())=\"est\",\"est\",\"-\")","v":"-"},"Asia",{"v":4.17857142857143,"d":"4.2"},"est",null,null,"TKM"]
[{"$f":"'12.lan'!D531","v":"TLS Timor-Leste"},"Timor-Leste",{"$f":"VLOOKUP(B214,'12.ppp data'!$C$3:$J$273,7,FALSE())","v":{"v":3.57442983561029,"d":"3.6"}},{"$f":"IF(VLOOKUP(B214,'12.ppp data'!$C$3:$J$273,8,FALSE())=\"est\",\"est\",\"-\")","v":"-"},"Asia",{"v":4.17857142857143,"d":"4.2"},"est",null,null,"TLS"]
[{"$f":"'12.lan'!D532","v":"TON Tonga"},"Tonga",{"$f":"VLOOKUP(B215,'12.ppp data'!$C$3:$J$273,7,FALSE())","v":{"v":1.74882856259574,"d":"1.7"}},{"$f":"IF(VLOOKUP(B215,'12.ppp data'!$C$3:$J$273,8,FALSE())=\"est\",\"est\",\"-\")","v":"-"},"Oceania",{"v":3,"d":"3.0"},"est",null,null,"TON"]
[{"$f":"'12.lan'!D533","v":"TTO Trinidad and Tobago"},"Trinidad and Tobago",{"$f":"VLOOKUP(B216,'12.ppp data'!$C$3:$J$273,7,FALSE())","v":{"v":2.1624826708371,"d":"2.2"}},{"$f":"IF(VLOOKUP(B216,'12.ppp data'!$C$3:$J$273,8,FALSE())=\"est\",\"est\",\"-\")","v":"-"},"Americas",{"v":3.42105263157895,"d":"3.4"},"est",null,null,"TTO"]
[{"$f":"'12.lan'!D534","v":"TUN Tunisia"},"Tunisia",{"$f":"VLOOKUP(B217,'12.ppp data'!$C$3:$J$273,7,FALSE())","v":{"v":3.81299347501787,"d":"3.8"}},{"$f":"IF(VLOOKUP(B217,'12.ppp data'!$C$3:$J$273,8,FALSE())=\"est\",\"est\",\"-\")","v":"-"},"Africa",{"v":3.70833333333333,"d":"3.7"},"est",null,null,"TUN"]
[{"$f":"'12.lan'!D535","v":"TUR Turkey"},"Turkey",{"$f":"VLOOKUP(B218,'12.ppp data'!$C$3:$J$273,7,FALSE())","v":{"v":2.98746103438262,"d":"3.0"}},{"$f":"IF(VLOOKUP(B218,'12.ppp data'!$C$3:$J$273,8,FALSE())=\"est\",\"est\",\"-\")","v":"-"},"Asia",{"v":5,"d":"5.0"},{"$nulls":3},"TUR"]
[{"$f":"'12.lan'!D536","v":"TUV Tuvalu"},"Tuvalu",{"$f":"VLOOKUP(B219,'12.ppp data'!$C$3:$J$273,7,FALSE())","v":{"v":1.25792177772362,"d":"1.3"}},{"$f":"IF(VLOOKUP(B219,'12.ppp data'!$C$3:$J$273,8,FALSE())=\"est\",\"est\",\"-\")","v":"-"},"Oceania",{"v":3,"d":"3.0"},"est",null,null,"TUV"]
[{"$f":"'12.lan'!D537","v":"TZA Tanzania, United Republic of"},"Tanzania",{"$f":"VLOOKUP(B220,'12.ppp data'!$C$3:$J$273,7,FALSE())","v":{"v":3.51393292517737,"d":"3.5"}},{"$f":"IF(VLOOKUP(B220,'12.ppp data'!$C$3:$J$273,8,FALSE())=\"est\",\"est\",\"-\")","v":"-"},"Africa",{"v":3,"d":"3.0"},{"$nulls":3},"TZA"]
[{"$f":"'12.lan'!D538","v":"UGA Uganda"},"Uganda",{"$f":"VLOOKUP(B221,'12.ppp data'!$C$3:$J$273,7,FALSE())","v":{"v":3.52833705552021,"d":"3.5"}},{"$f":"IF(VLOOKUP(B221,'12.ppp data'!$C$3:$J$273,8,FALSE())=\"est\",\"est\",\"-\")","v":"-"},"Africa",{"v":3,"d":"3.0"},{"$nulls":3},"UGA"]
[{"$f":"'12.lan'!D539","v":"UKR Ukraine"},"Ukraine",{"$f":"VLOOKUP(B222,'12.ppp data'!$C$3:$J$273,7,FALSE())","v":{"v":3.68188875221352,"d":"3.7"}},{"$f":"IF(VLOOKUP(B222,'12.ppp data'!$C$3:$J$273,8,FALSE())=\"est\",\"est\",\"-\")","v":"-"},"Europe",{"v":6,"d":"6.0"},{"$nulls":3},"UKR"]
[{"$f":"'12.lan'!D540","v":"URY Uruguay"},"Uruguay",{"$f":"VLOOKUP(B223,'12.ppp data'!$C$3:$J$273,7,FALSE())","v":{"v":1.46570022305667,"d":"1.5"}},{"$f":"IF(VLOOKUP(B223,'12.ppp data'!$C$3:$J$273,8,FALSE())=\"est\",\"est\",\"-\")","v":"-"},"Americas",{"v":1,"d":"1.0"},{"$nulls":3},"URY"]
[{"$f":"'12.lan'!D541","v":"USA United States"},"United States",{"$f":"VLOOKUP(B224,'12.ppp data'!$C$3:$J$273,7,FALSE())","v":{"v":1.12949,"d":"1.1"}},{"$f":"IF(VLOOKUP(B224,'12.ppp data'!$C$3:$J$273,8,FALSE())=\"est\",\"est\",\"-\")","v":"-"},"Americas",{"v":4,"d":"4.0"},{"$nulls":3},"USA"]
[{"$f":"'12.lan'!D542","v":"UZB Uzbekistan"},"Uzbekistan",{"$f":"VLOOKUP(B225,'12.ppp data'!$C$3:$J$273,7,FALSE())","v":{"v":5.11089127208673,"d":"5.1"}},{"$f":"IF(VLOOKUP(B225,'12.ppp data'!$C$3:$J$273,8,FALSE())=\"est\",\"est\",\"-\")","v":"-"},"Asia",{"v":4.17857142857143,"d":"4.2"},"est",null,null,"UZB"]
[{"$f":"'12.lan'!D543","v":"VCT Saint Vincent and the Grenadines"},"St. Vincent and the Grenadines",{"$f":"VLOOKUP(B226,'12.ppp data'!$C$3:$J$273,7,FALSE())","v":{"v":1.85128745821471,"d":"1.9"}},{"$f":"IF(VLOOKUP(B226,'12.ppp data'!$C$3:$J$273,8,FALSE())=\"est\",\"est\",\"-\")","v":"-"},"Americas",{"v":3.42105263157895,"d":"3.4"},"est",null,null,"VCT"]
[{"$f":"'12.lan'!D544","v":"VEN Venezuela, Bolivarian Republic of"},"Venezuela, RB",{"$f":"VLOOKUP(B227,'12.ppp data'!$C$3:$J$273,7,FALSE())","v":{"v":1.96289944979353,"d":"2.0"}},{"$f":"IF(VLOOKUP(B227,'12.ppp data'!$C$3:$J$273,8,FALSE())=\"est\",\"est\",\"-\")","v":"est"},"Americas",{"v":3,"d":"3.0"},{"$nulls":3},"VEN"]
[{"$f":"'12.lan'!D545","v":"VGB Virgin Islands, British"},"British Virgin Islands",{"$f":"VLOOKUP(B228,'12.ppp data'!$C$3:$J$273,7,FALSE())","v":{"v":1.96289944979353,"d":"2.0"}},{"$f":"IF(VLOOKUP(B228,'12.ppp data'!$C$3:$J$273,8,FALSE())=\"est\",\"est\",\"-\")","v":"est"},"Americas",{"v":3.42105263157895,"d":"3.4"},"est",null,null,"VGB"]
[{"$f":"'12.lan'!D546","v":"VIR Virgin Islands, U.S."},"Virgin Islands (U.S.)",{"$f":"VLOOKUP(B229,'12.ppp data'!$C$3:$J$273,7,FALSE())","v":{"v":1.96289944979353,"d":"2.0"}},{"$f":"IF(VLOOKUP(B229,'12.ppp data'!$C$3:$J$273,8,FALSE())=\"est\",\"est\",\"-\")","v":"est"},"Americas",{"v":3.42105263157895,"d":"3.4"},"est",null,null,"VIR"]
[{"$f":"'12.lan'!D547","v":"VNM Viet Nam"},"Vietnam",{"$f":"VLOOKUP(B230,'12.ppp data'!$C$3:$J$273,7,FALSE())","v":{"v":3.27883966964401,"d":"3.3"}},{"$f":"IF(VLOOKUP(B230,'12.ppp data'!$C$3:$J$273,8,FALSE())=\"est\",\"est\",\"-\")","v":"-"},"Asia",{"v":4.17857142857143,"d":"4.2"},"est",null,null,"VNM"]
[{"$f":"'12.lan'!D548","v":"VUT Vanuatu"},"Vanuatu",{"$f":"VLOOKUP(B231,'12.ppp data'!$C$3:$J$273,7,FALSE())","v":{"v":1.15944366563601,"d":"1.2"}},{"$f":"IF(VLOOKUP(B231,'12.ppp data'!$C$3:$J$273,8,FALSE())=\"est\",\"est\",\"-\")","v":"-"},"Oceania",{"v":3,"d":"3.0"},"est",null,null,"VUT"]
[{"$f":"'12.lan'!D549","v":"WSM Samoa"},"Samoa",{"$f":"VLOOKUP(B232,'12.ppp data'!$C$3:$J$273,7,FALSE())","v":{"v":0.687662221419364,"d":"0.7"}},{"$f":"IF(VLOOKUP(B232,'12.ppp data'!$C$3:$J$273,8,FALSE())=\"est\",\"est\",\"-\")","v":"-"},"Oceania",{"v":3,"d":"3.0"},"est",null,null,"WSM"]
[{"$f":"'12.lan'!D550","v":"XKX Kosovo"},"Kosovo",{"$f":"VLOOKUP(B233,'12.ppp data'!$C$3:$J$273,7,FALSE())","v":{"v":3.51525356456448,"d":"3.5"}},{"$f":"IF(VLOOKUP(B233,'12.ppp data'!$C$3:$J$273,8,FALSE())=\"est\",\"est\",\"-\")","v":"-"},"Europe",{"v":2,"d":"2.0"},"est",null,null,"XKX"]
[{"$f":"'12.lan'!D551","v":"YEM Yemen"},"Yemen, Rep.",{"$f":"VLOOKUP(B234,'12.ppp data'!$C$3:$J$273,7,FALSE())","v":{"v":3.00272943672245,"d":"3.0"}},{"$f":"IF(VLOOKUP(B234,'12.ppp data'!$C$3:$J$273,8,FALSE())=\"est\",\"est\",\"-\")","v":"est"},"Asia",{"v":4.17857142857143,"d":"4.2"},"est",null,null,"YEM"]
[{"$f":"'12.lan'!D552","v":"ZAF South Africa"},"South Africa",{"$f":"VLOOKUP(B235,'12.ppp data'!$C$3:$J$273,7,FALSE())","v":{"v":2.47213265312851,"d":"2.5"}},{"$f":"IF(VLOOKUP(B235,'12.ppp data'!$C$3:$J$273,8,FALSE())=\"est\",\"est\",\"-\")","v":"-"},"Africa",{"v":1,"d":"1.0"},{"$nulls":3},"ZAF"]
[{"$f":"'12.lan'!D553","v":"ZMB Zambia"},"Zambia",{"$f":"VLOOKUP(B236,'12.ppp data'!$C$3:$J$273,7,FALSE())","v":{"v":3.02176670175857,"d":"3.0"}},{"$f":"IF(VLOOKUP(B236,'12.ppp data'!$C$3:$J$273,8,FALSE())=\"est\",\"est\",\"-\")","v":"-"},"Africa",{"v":5,"d":"5.0"},{"$nulls":3},"ZMB"]
[{"$f":"'12.lan'!D554","v":"ZWE Zimbabwe"},"Zimbabwe",{"$f":"VLOOKUP(B237,'12.ppp data'!$C$3:$J$273,7,FALSE())","v":{"v":3.03256163278312,"d":"3.0"}},{"$f":"IF(VLOOKUP(B237,'12.ppp data'!$C$3:$J$273,8,FALSE())=\"est\",\"est\",\"-\")","v":"est"},"Africa",{"v":5,"d":"5.0"},{"$nulls":3},"ZWE"]
[{"$f":"'12.lan'!D555","v":"Average Africa"},"Africa",{"$f":"'12.ppp data'!K3","v":{"v":3.03256163278312,"d":"3.03"}},null,null,{"v":3.70833333333333,"d":"3.71"},{"$nulls":3},"Average Africa"]
[{"$f":"'12.lan'!D556","v":"Average Americas"},"Americas",{"$f":"'12.ppp data'!K57","v":{"v":1.96289944979353,"d":"1.96"}},null,null,{"v":3.42105263157895,"d":"3.4"},{"$nulls":3},"Average Americas"]
[{"$f":"'12.lan'!D557","v":"Average Asia"},"Asia",{"$f":"'12.ppp data'!K103","v":{"v":3.00272943672245,"d":"3.00"}},null,null,{"v":4.17857142857143,"d":"4.18"},{"$nulls":3},"Average Asia"]
[{"$f":"'12.lan'!D558","v":"Average Europe"},"Europe",{"$f":"'12.ppp data'!K153","v":{"v":1.93286164519776,"d":"1.93"}},null,null,{"v":2,"d":"2.00"},{"$nulls":3},"Average Europe"]
[{"$f":"'12.lan'!D559","v":"Average Oceania"},"Oceania",{"$f":"'12.ppp data'!K200","v":{"v":1.35633083709363,"d":"1.36"}},null,null,{"v":3,"d":"3.00"},{"$nulls":3},"Average Oceania"]
[{"$f":"'12.lan'!D560","v":0},null,0.978035862587365,null,null,{"v":3.23809523809524,"d":"3"},{"$nulls":3},"World"]

{"sheet":"12.ppp data","index":12,"n_rows":266,"n_cols":12,"rows_kept":266,"hidden":true}
[]
[null,null,"Country Name","Exchange Rate $ 2017","Exchange Rate country 2017 (oanda)","ppp gdp conversion factor 2017","conversion factor","Region",null,"est","Regional Estimate calculationen"]
[null,null,"Sao Tome and Principe",{"v":1.12949,"d":"1.129 "},null,{"v":12463.5635198013,"d":"12,463.564 "},{"$f":"D3*E3/F3","v":0},{"$f":"VLOOKUP(C3,'11.Region'!$B$22:$E$243,4,FALSE())","v":"Africa"},{"$f":"$K$3","v":{"v":3.03256163278312,"d":"3.03 "}},"est",{"$f":"AVERAGE(G5:G51)","v":{"v":3.03256163278312,"d":"3.03 "}},"Africa"]
[null,null,"Zimbabwe",{"v":1.12949,"d":"1.129 "},null,{"v":0.51762968529526,"d":"0.518 "},{"$f":"D4*E4/F4","v":0},{"$f":"VLOOKUP(C4,'11.Region'!$B$22:$E$243,4,FALSE())","v":"Africa"},{"$f":"$K$3","v":{"v":3.03256163278312,"d":"3.03 "}},"est"]
[null,null,"Angola",{"v":1.12949,"d":"1.129 "},{"v":165.09042,"d":"165.090 "},{"v":108.299425238122,"d":"108.299 "},{"$f":"D5*E5/F5","v":{"v":1.72178179224687,"d":"1.72 "}},{"$f":"VLOOKUP(C5,'11.Region'!$B$22:$E$243,4,FALSE())","v":"Africa"},{"$f":"G5","v":{"v":1.72178179224687,"d":"1.72 "}}]
[null,null,"Sudan",{"v":1.12949,"d":"1.129 "},{"v":6.60668,"d":"6.607 "},{"v":4.13776545849889,"d":"4.138 "},{"$f":"D6*E6/F6","v":{"v":1.80343208624182,"d":"1.80 "}},{"$f":"VLOOKUP(C6,'11.Region'!$B$22:$E$243,4,FALSE())","v":"Africa"},{"$f":"G6","v":{"v":1.80343208624182,"d":"1.80 "}}]
[null,null,"Central African Republic",{"v":1.12949,"d":"1.129 "},{"v":581.90317,"d":"581.903 "},{"v":335.500361622859,"d":"335.500 "},{"$f":"D7*E7/F7","v":{"v":1.95902564248837,"d":"1.96 "}},{"$f":"VLOOKUP(C7,'11.Region'!$B$22:$E$243,4,FALSE())","v":"Africa"},{"$f":"G7","v":{"v":1.95902564248837,"d":"1.96 "}}]
[null,null,"Seychelles",{"v":1.12949,"d":"1.129 "},{"v":12.72334,"d":"12.723 "},{"v":7.30586505705509,"d":"7.306 "},{"$f":"D8*E8/F8","v":{"v":1.96703404516381,"d":"1.97 "}},{"$f":"VLOOKUP(C8,'11.Region'!$B$22:$E$243,4,FALSE())","v":"Africa"},{"$f":"G8","v":{"v":1.96703404516381,"d":"1.97 "}}]
[null,null,"Congo, Dem. Rep.",{"v":1.12949,"d":"1.129 "},{"v":1440.44336,"d":"1,440.443 "},{"v":763.855751739276,"d":"763.856 "},{"$f":"D9*E9/F9","v":{"v":2.12993928105123,"d":"2.13 "}},{"$f":"VLOOKUP(C9,'11.Region'!$B$22:$E$243,4,FALSE())","v":"Africa"},{"$f":"G9","v":{"v":2.12993928105123,"d":"2.13 "}}]
[null,null,"Comoros",{"v":1.12949,"d":"1.129 "},{"v":436.44655,"d":"436.447 "},{"v":224.237692431855,"d":"224.238 "},{"$f":"D10*E10/F10","v":{"v":2.1983905043498,"d":"2.20 "}},{"$f":"VLOOKUP(C10,'11.Region'!$B$22:$E$243,4,FALSE())","v":"Africa"},{"$f":"G10","v":{"v":2.1983905043498,"d":"2.20 "}}]
[null,null,"Namibia",{"v":1.12949,"d":"1.129 "},{"v":13.2992,"d":"13.299 "},{"v":6.64300479615375,"d":"6.643 "},{"$f":"D11*E11/F11","v":{"v":2.26122272509832,"d":"2.26 "}},{"$f":"VLOOKUP(C11,'11.Region'!$B$22:$E$243,4,FALSE())","v":"Africa"},{"$f":"G11","v":{"v":2.26122272509832,"d":"2.26 "}}]
[null,null,"Mauritius",{"v":1.12949,"d":"1.129 "},{"v":33.25729,"d":"33.257 "},{"v":16.3243952541092,"d":"16.324 "},{"$f":"D12*E12/F12","v":{"v":2.30108226965678,"d":"2.30 "}},{"$f":"VLOOKUP(C12,'11.Region'!$B$22:$E$243,4,FALSE())","v":"Africa"},{"$f":"G12","v":{"v":2.30108226965678,"d":"2.30 "}}]
[null,null,"Cabo Verde",{"v":1.12949,"d":"1.129 "},{"v":97.81675,"d":"97.817 "},{"v":45.992605173421,"d":"45.993 "},{"$f":"D13*E13/F13","v":{"v":2.40219140752974,"d":"2.40 "}},{"$f":"VLOOKUP(C13,'11.Region'!$B$22:$E$243,4,FALSE())","v":"Africa"},{"$f":"G13","v":{"v":2.40219140752974,"d":"2.40 "}}]
[null,null,"Kenya",{"v":1.12949,"d":"1.129 "},{"v":101.76897,"d":"101.769 "},{"v":47.4524477845985,"d":"47.452 "},{"$f":"D14*E14/F14","v":{"v":2.42236258173826,"d":"2.42 "}},{"$f":"VLOOKUP(C14,'11.Region'!$B$22:$E$243,4,FALSE())","v":"Africa"},{"$f":"G14","v":{"v":2.42236258173826,"d":"2.42 "}}]
[null,null,"South Africa",{"v":1.12949,"d":"1.129 "},{"v":13.2992,"d":"13.299 "},{"v":6.0762570281131,"d":"6.076 "},{"$f":"D15*E15/F15","v":{"v":2.47213265312851,"d":"2.47 "}},{"$f":"VLOOKUP(C15,'11.Region'!$B$22:$E$243,4,FALSE())","v":"Africa"},{"$f":"G15","v":{"v":2.47213265312851,"d":"2.47 "}}]
[null,null,"Botswana",{"v":1.12949,"d":"1.129 "},{"v":10.22584,"d":"10.226 "},{"v":4.52886496554253,"d":"4.529 "},{"$f":"D16*E16/F16","v":{"v":2.55030434987067,"d":"2.55 "}},{"$f":"VLOOKUP(C16,'11.Region'!$B$22:$E$243,4,FALSE())","v":"Africa"},{"$f":"G16","v":{"v":2.55030434987067,"d":"2.55 "}}]
[null,null,"Guinea-Bissau",{"v":1.12949,"d":"1.129 "},{"v":581.57419,"d":"581.574 "},{"v":247.754889036848,"d":"247.755 "},{"$f":"D17*E17/F17","v":{"v":2.65133912964036,"d":"2.65 "}},{"$f":"VLOOKUP(C17,'11.Region'!$B$22:$E$243,4,FALSE())","v":"Africa"},{"$f":"G17","v":{"v":2.65133912964036,"d":"2.65 "}}]
[null,null,"Burundi",{"v":1.12949,"d":"1.129 "},{"v":1699.34338,"d":"1,699.343 "},{"v":717.88571949917,"d":"717.886 "},{"$f":"D18*E18/F18","v":{"v":2.67367256673563,"d":"2.67 "}},{"$f":"VLOOKUP(C18,'11.Region'!$B$22:$E$243,4,FALSE())","v":"Africa"},{"$f":"G18","v":{"v":2.67367256673563,"d":"2.67 "}}]
[null,null,"Cote d'Ivoire",{"v":1.12949,"d":"1.129 "},{"v":581.57419,"d":"581.574 "},{"v":244.777496307491,"d":"244.777 "},{"$f":"D19*E19/F19","v":{"v":2.68358914431382,"d":"2.68 "}},{"$f":"VLOOKUP(C19,'11.Region'!$B$22:$E$243,4,FALSE())","v":"Africa"},{"$f":"G19","v":{"v":2.68358914431382,"d":"2.68 "}}]
[null,null,"Libya",{"v":1.12949,"d":"1.129 "},{"v":1.3707,"d":"1.371 "},{"v":0.564428715470327,"d":"0.564 "},{"$f":"D20*E20/F20","v":{"v":2.74293617699787,"d":"2.74 "}},{"$f":"VLOOKUP(C20,'11.Region'!$B$22:$E$243,4,FALSE())","v":"Africa"},{"$f":"G20","v":{"v":2.74293617699787,"d":"2.74 "}}]
[null,null,"Gabon",{"v":1.12949,"d":"1.129 "},{"v":581.90317,"d":"581.903 "},{"v":231.155170200789,"d":"231.155 "},{"$f":"D21*E21/F21","v":{"v":2.84334462825291,"d":"2.84 "}},{"$f":"VLOOKUP(C21,'11.Region'!$B$22:$E$243,4,FALSE())","v":"Africa"},{"$f":"G21","v":{"v":2.84334462825291,"d":"2.84 "}}]
[null,null,"Equatorial Guinea",{"v":1.12949,"d":"1.129 "},{"v":581.90317,"d":"581.903 "},{"v":231.038017628135,"d":"231.038 "},{"$f":"D22*E22/F22","v":{"v":2.84478640455259,"d":"2.84 "}},{"$f":"VLOOKUP(C22,'11.Region'!$B$22:$E$243,4,FALSE())","v":"Africa"},{"$f":"G22","v":{"v":2.84478640455259,"d":"2.84 "}}]
[null,null,"Togo",{"v":1.12949,"d":"1.129 "},{"v":581.57419,"d":"581.574 "},{"v":228.864685269555,"d":"228.865 "},{"$f":"D23*E23/F23","v":{"v":2.870177332468,"d":"2.87 "}},{"$f":"VLOOKUP(C23,'11.Region'!$B$22:$E$243,4,FALSE())","v":"Africa"},{"$f":"G23","v":{"v":2.870177332468,"d":"2.87 "}}]
[null,null,"Cameroon",{"v":1.12949,"d":"1.129 "},{"v":581.90317,"d":"581.903 "},{"v":227.956784579026,"d":"227.957 "},{"$f":"D24*E24/F24","v":{"v":2.883238648488,"d":"2.88 "}},{"$f":"VLOOKUP(C24,'11.Region'!$B$22:$E$243,4,FALSE())","v":"Africa"},{"$f":"G24","v":{"v":2.883238648488,"d":"2.88 "}}]
[null,null,"Ethiopia",{"v":1.12949,"d":"1.129 "},{"v":23.72109,"d":"23.721 "},{"v":9.06336952150157,"d":"9.063 "},{"$f":"D25*E25/F25","v":{"v":2.95615597273597,"d":"2.96 "}},{"$f":"VLOOKUP(C25,'11.Region'!$B$22:$E$243,4,FALSE())","v":"Africa"},{"$f":"G25","v":{"v":2.95615597273597,"d":"2.96 "}}]
[null,null,"Senegal",{"v":1.12949,"d":"1.129 "},{"v":581.57419,"d":"581.574 "},{"v":221.707078638369,"d":"221.707 "},{"$f":"D26*E26/F26","v":{"v":2.96283833559755,"d":"2.96 "}},{"$f":"VLOOKUP(C26,'11.Region'!$B$22:$E$243,4,FALSE())","v":"Africa"},{"$f":"G26","v":{"v":2.96283833559755,"d":"2.96 "}}]
[null,null,"Swaziland",{"v":1.12949,"d":"1.129 "},{"v":13.2992,"d":"13.299 "},{"v":5.06026211181042,"d":"5.060 "},{"$f":"D27*E27/F27","v":{"v":2.9684852436677,"d":"2.97 "}},{"$f":"VLOOKUP(C27,'11.Region'!$B$22:$E$243,4,FALSE())","v":"Africa"},{"$f":"G27","v":{"v":2.9684852436677,"d":"2.97 "}}]
[null,null,"Lesotho",{"v":1.12949,"d":"1.129 "},{"v":13.2992,"d":"13.299 "},{"v":5.03426740721094,"d":"5.034 "},{"$f":"D28*E28/F28","v":{"v":2.98381317338922,"d":"2.98 "}},{"$f":"VLOOKUP(C28,'11.Region'!$B$22:$E$243,4,FALSE())","v":"Africa"},{"$f":"G28","v":{"v":2.98381317338922,"d":"2.98 "}}]
[null,null,"Guinea",{"v":1.12949,"d":"1.129 "},{"v":9041.48481,"d":"9,041.485 "},{"v":3386.11756067565,"d":"3,386.118 "},{"$f":"D29*E29/F29","v":{"v":3.01592206857968,"d":"3.02 "}},{"$f":"VLOOKUP(C29,'11.Region'!$B$22:$E$243,4,FALSE())","v":"Africa"},{"$f":"G29","v":{"v":3.01592206857968,"d":"3.02 "}}]
[null,null,"Zambia",{"v":1.12949,"d":"1.129 "},{"v":9.49354,"d":"9.494 "},{"v":3.5485394978903,"d":"3.549 "},{"$f":"D30*E30/F30","v":{"v":3.02176670175857,"d":"3.02 "}},{"$f":"VLOOKUP(C30,'11.Region'!$B$22:$E$243,4,FALSE())","v":"Africa"},{"$f":"G30","v":{"v":3.02176670175857,"d":"3.02 "}}]
[null,null,"Mali",{"v":1.12949,"d":"1.129 "},{"v":581.57419,"d":"581.574 "},{"v":217.03135676953,"d":"217.031 "},{"$f":"D31*E31/F31","v":{"v":3.02666970174571,"d":"3.03 "}},{"$f":"VLOOKUP(C31,'11.Region'!$B$22:$E$243,4,FALSE())","v":"Africa"},{"$f":"G31","v":{"v":3.02666970174571,"d":"3.03 "}}]
[null,null,"Niger",{"v":1.12949,"d":"1.129 "},{"v":581.57419,"d":"581.574 "},{"v":216.470484936777,"d":"216.470 "},{"$f":"D32*E32/F32","v":{"v":3.03451175828867,"d":"3.03 "}},{"$f":"VLOOKUP(C32,'11.Region'!$B$22:$E$243,4,FALSE())","v":"Africa"},{"$f":"G32","v":{"v":3.03451175828867,"d":"3.03 "}}]
[null,null,"Rwanda",{"v":1.12949,"d":"1.129 "},{"v":823.42092,"d":"823.421 "},{"v":305.706078126625,"d":"305.706 "},{"$f":"D33*E33/F33","v":{"v":3.04228722120981,"d":"3.04 "}},{"$f":"VLOOKUP(C33,'11.Region'!$B$22:$E$243,4,FALSE())","v":"Africa"},{"$f":"G33","v":{"v":3.04228722120981,"d":"3.04 "}}]
[null,null,"Morocco",{"v":1.12949,"d":"1.129 "},{"v":9.57992,"d":"9.580 "},{"v":3.54686354775819,"d":"3.547 "},{"$f":"D34*E34/F34","v":{"v":3.050702034376,"d":"3.05 "}},{"$f":"VLOOKUP(C34,'11.Region'!$B$22:$E$243,4,FALSE())","v":"Africa"},{"$f":"G34","v":{"v":3.050702034376,"d":"3.05 "}}]
[null,null,"Benin",{"v":1.12949,"d":"1.129 "},{"v":581.57419,"d":"581.574 "},{"v":212.700771970014,"d":"212.701 "},{"$f":"D35*E35/F35","v":{"v":3.08829265535391,"d":"3.09 "}},{"$f":"VLOOKUP(C35,'11.Region'!$B$22:$E$243,4,FALSE())","v":"Africa"},{"$f":"G35","v":{"v":3.08829265535391,"d":"3.09 "}}]
[null,null,"Burkina Faso",{"v":1.12949,"d":"1.129 "},{"v":581.57419,"d":"581.574 "},{"v":208.924006880881,"d":"208.924 "},{"$f":"D36*E36/F36","v":{"v":3.14412039894307,"d":"3.14 "}},{"$f":"VLOOKUP(C36,'11.Region'!$B$22:$E$243,4,FALSE())","v":"Africa"},{"$f":"G36","v":{"v":3.14412039894307,"d":"3.14 "}}]
[null,null,"Ghana",{"v":1.12949,"d":"1.129 "},{"v":4.379563096,"d":"4.380 "},{"v":1.53866712711638,"d":"1.539 "},{"$f":"D37*E37/F37","v":{"v":3.21490765229489,"d":"3.21 "}},{"$f":"VLOOKUP(C37,'11.Region'!$B$22:$E$243,4,FALSE())","v":"Africa"},{"$f":"G37","v":{"v":3.21490765229489,"d":"3.21 "}}]
[null,null,"Chad",{"v":1.12949,"d":"1.129 "},{"v":581.90317,"d":"581.903 "},{"v":200.876869467229,"d":"200.877 "},{"$f":"D38*E38/F38","v":{"v":3.27192380698926,"d":"3.27 "}},{"$f":"VLOOKUP(C38,'11.Region'!$B$22:$E$243,4,FALSE())","v":"Africa"},{"$f":"G38","v":{"v":3.27192380698926,"d":"3.27 "}}]
[null,null,"Mozambique",{"v":1.12949,"d":"1.129 "},{"v":63.95229,"d":"63.952 "},{"v":21.2034188057773,"d":"21.203 "},{"$f":"D39*E39/F39","v":{"v":3.40668986891956,"d":"3.41 "}},{"$f":"VLOOKUP(C39,'11.Region'!$B$22:$E$243,4,FALSE())","v":"Africa"},{"$f":"G39","v":{"v":3.40668986891956,"d":"3.41 "}}]
[null,null,"Tanzania",{"v":1.12949,"d":"1.129 "},{"v":2203.9815,"d":"2,203.982 "},{"v":708.429875424941,"d":"708.430 "},{"$f":"D40*E40/F40","v":{"v":3.51393292517737,"d":"3.51 "}},{"$f":"VLOOKUP(C40,'11.Region'!$B$22:$E$243,4,FALSE())","v":"Africa"},{"$f":"G40","v":{"v":3.51393292517737,"d":"3.51 "}}]
[null,null,"Sierra Leone",{"v":1.12949,"d":"1.129 "},{"v":7455.17468,"d":"7,455.175 "},{"v":2393.50987734811,"d":"2,393.510 "},{"$f":"D41*E41/F41","v":{"v":3.51807415921038,"d":"3.52 "}},{"$f":"VLOOKUP(C41,'11.Region'!$B$22:$E$243,4,FALSE())","v":"Africa"},{"$f":"G41","v":{"v":3.51807415921038,"d":"3.52 "}}]
[null,null,"Uganda",{"v":1.12949,"d":"1.129 "},{"v":3572.01577,"d":"3,572.016 "},{"v":1143.47241450334,"d":"1,143.472 "},{"$f":"D42*E42/F42","v":{"v":3.52833705552021,"d":"3.53 "}},{"$f":"VLOOKUP(C42,'11.Region'!$B$22:$E$243,4,FALSE())","v":"Africa"},{"$f":"G42","v":{"v":3.52833705552021,"d":"3.53 "}}]
[null,null,"Nigeria",{"v":1.12949,"d":"1.129 "},{"v":331.66749,"d":"331.667 "},{"v":102.709364222796,"d":"102.709 "},{"$f":"D43*E43/F43","v":{"v":3.64733163441153,"d":"3.65 "}},{"$f":"VLOOKUP(C43,'11.Region'!$B$22:$E$243,4,FALSE())","v":"Africa"},{"$f":"G43","v":{"v":3.64733163441153,"d":"3.65 "}}]
[null,null,"Congo, Rep.",{"v":1.12949,"d":"1.129 "},{"v":581.90317,"d":"581.903 "},{"v":180.094206627859,"d":"180.094 "},{"$f":"D44*E44/F44","v":{"v":3.6495000244035,"d":"3.65 "}},{"$f":"VLOOKUP(C44,'11.Region'!$B$22:$E$243,4,FALSE())","v":"Africa"},{"$f":"G44","v":{"v":3.6495000244035,"d":"3.65 "}}]
[null,null,"Tunisia",{"v":1.12949,"d":"1.129 "},{"v":2.39372,"d":"2.394 "},{"v":0.709070923019958,"d":"0.709 "},{"$f":"D45*E45/F45","v":{"v":3.81299347501787,"d":"3.81 "}},{"$f":"VLOOKUP(C45,'11.Region'!$B$22:$E$243,4,FALSE())","v":"Africa"},{"$f":"G45","v":{"v":3.81299347501787,"d":"3.81 "}}]
[null,null,"Madagascar",{"v":1.12949,"d":"1.129 "},{"v":3082.79126,"d":"3,082.791 "},{"v":901.185877596255,"d":"901.186 "},{"$f":"D46*E46/F46","v":{"v":3.86377770315813,"d":"3.86 "}},{"$f":"VLOOKUP(C46,'11.Region'!$B$22:$E$243,4,FALSE())","v":"Africa"},{"$f":"G46","v":{"v":3.86377770315813,"d":"3.86 "}}]
[null,null,"Gambia, The",{"v":1.12949,"d":"1.129 "},{"v":44.95457,"d":"44.955 "},{"v":13.1299270599643,"d":"13.130 "},{"$f":"D47*E47/F47","v":{"v":3.86717588280632,"d":"3.87 "}},{"$f":"VLOOKUP(C47,'11.Region'!$B$22:$E$243,4,FALSE())","v":"Africa"},{"$f":"G47","v":{"v":3.86717588280632,"d":"3.87 "}}]
[null,null,"Mauritania",{"v":1.12949,"d":"1.129 "},{"v":354.70191,"d":"354.702 "},{"v":102.914772361353,"d":"102.915 "},{"$f":"D48*E48/F48","v":{"v":3.89285474896845,"d":"3.89 "}},{"$f":"VLOOKUP(C48,'11.Region'!$B$22:$E$243,4,FALSE())","v":"Africa"},{"$f":"G48","v":{"v":3.89285474896845,"d":"3.89 "}}]
[null,null,"Malawi",{"v":1.12949,"d":"1.129 "},{"v":718.93711,"d":"718.937 "},{"v":205.611763569026,"d":"205.612 "},{"$f":"D49*E49/F49","v":{"v":3.94934736358746,"d":"3.95 "}},{"$f":"VLOOKUP(C49,'11.Region'!$B$22:$E$243,4,FALSE())","v":"Africa"},{"$f":"G49","v":{"v":3.94934736358746,"d":"3.95 "}}]
[null,null,"Algeria",{"v":1.12949,"d":"1.129 "},{"v":110.44233,"d":"110.442 "},{"v":29.9557277566339,"d":"29.956 "},{"$f":"D50*E50/F50","v":{"v":4.16426228483382,"d":"4.16 "}},{"$f":"VLOOKUP(C50,'11.Region'!$B$22:$E$243,4,FALSE())","v":"Africa"},{"$f":"G50","v":{"v":4.16426228483382,"d":"4.16 "}}]
[null,null,"Egypt, Arab Rep.",{"v":1.12949,"d":"1.129 "},{"v":17.8138,"d":"17.814 "},{"v":3.07101784206236,"d":"3.071 "},{"$f":"D51*E51/F51","v":{"v":6.55173951984856,"d":"6.55 "}},{"$f":"VLOOKUP(C51,'11.Region'!$B$22:$E$243,4,FALSE())","v":"Africa"},{"$f":"G51","v":{"v":6.55173951984856,"d":"6.55 "}}]
[null,null,"Liberia",{"v":1.12949,"d":"1.129 "},{"v":102.73307,"d":"102.733 "},{"v":0.551820541973775,"d":"0.552 "},{"$f":"D52*E52/F52","v":{"v":210.278462666971,"d":"210.28 "}},{"$f":"VLOOKUP(C52,'11.Region'!$B$22:$E$243,4,FALSE())","v":"Africa"},{"$f":"$K$3","v":{"v":3.03256163278312,"d":"3.03 "}},"est"]
[null,null,"Djibouti",{"v":1.12949,"d":"1.129 "},{"v":177.71958,"d":"177.720 "},null,{"$f":"D53*E53/F53","v":{"$error":"#DIV/0!"}},{"$f":"VLOOKUP(C53,'11.Region'!$B$22:$E$243,4,FALSE())","v":"Africa"},{"$f":"$K$3","v":{"v":3.03256163278312,"d":"3.03 "}},"est"]
[null,null,"Eritrea",{"v":1.12949,"d":"1.129 "},null,null,{"$f":"D54*E54/F54","v":{"$error":"#DIV/0!"}},{"$f":"VLOOKUP(C54,'11.Region'!$B$22:$E$243,4,FALSE())","v":"Africa"},{"$f":"$K$3","v":{"v":3.03256163278312,"d":"3.03 "}},"est"]
[null,null,"Somalia",{"v":1.12949,"d":"1.129 "},{"v":545.65568,"d":"545.656 "},null,{"$f":"D55*E55/F55","v":{"$error":"#DIV/0!"}},{"$f":"VLOOKUP(C55,'11.Region'!$B$22:$E$243,4,FALSE())","v":"Africa"},{"$f":"$K$3","v":{"v":3.03256163278312,"d":"3.03 "}},"est"]
[null,null,"South Sudan",{"v":1.12949,"d":"1.129 "},null,{"v":0,"d":"-.0 "},{"$f":"D56*E56/F56","v":{"$error":"#DIV/0!"}},{"$f":"VLOOKUP(C56,'11.Region'!$B$22:$E$243,4,FALSE())","v":"Africa"},{"$f":"$K$3","v":{"v":3.03256163278312,"d":"3.03 "}},"est"]
[null,null,"Bahamas, The",{"v":1.12949,"d":"1.129 "},{"v":1,"d":"1.000 "},{"v":1.01090506442159,"d":"1.011 "},{"$f":"D57*E57/F57","v":{"v":1.11730570926189,"d":"1.12 "}},{"$f":"VLOOKUP(C57,'11.Region'!$B$22:$E$243,4,FALSE())","v":"Americas"},{"$f":"G57","v":{"v":1.11730570926189,"d":"1.12 "}},null,{"$f":"AVERAGE(G57:G89)","v":{"v":1.96289944979353,"d":"1.96 "}},"Americas"]
[null,null,"United States",{"v":1.12949,"d":"1.129 "},{"v":1,"d":"1.000 "},{"v":1,"d":"1.000 "},{"$f":"D58*E58/F58","v":{"v":1.12949,"d":"1.13 "}},{"$f":"VLOOKUP(C58,'11.Region'!$B$22:$E$243,4,FALSE())","v":"Americas"},{"$f":"G58","v":{"v":1.12949,"d":"1.13 "}}]
[null,null,"Canada",{"v":1.12949,"d":"1.129 "},{"v":1.298,"d":"1.298 "},{"v":1.260086,"d":"1.260 "},{"$f":"D59*E59/F59","v":{"v":1.16347457237046,"d":"1.16 "}},{"$f":"VLOOKUP(C59,'11.Region'!$B$22:$E$243,4,FALSE())","v":"Americas"},{"$f":"G59","v":{"v":1.16347457237046,"d":"1.16 "}}]
[null,null,"Barbados",{"v":1.12949,"d":"1.129 "},{"v":2,"d":"2.000 "},{"v":1.80141392038228,"d":"1.801 "},{"$f":"D60*E60/F60","v":{"v":1.25400385466135,"d":"1.25 "}},{"$f":"VLOOKUP(C60,'11.Region'!$B$22:$E$243,4,FALSE())","v":"Americas"},{"$f":"G60","v":{"v":1.25400385466135,"d":"1.25 "}}]
[null,null,"Uruguay",{"v":1.12949,"d":"1.129 "},{"v":28.2364,"d":"28.236 "},{"v":21.7593822626899,"d":"21.759 "},{"$f":"D61*E61/F61","v":{"v":1.46570022305667,"d":"1.47 "}},{"$f":"VLOOKUP(C61,'11.Region'!$B$22:$E$243,4,FALSE())","v":"Americas"},{"$f":"G61","v":{"v":1.46570022305667,"d":"1.47 "}}]
[null,null,"Dominica",{"v":1.12949,"d":"1.129 "},{"v":2.7,"d":"2.700 "},{"v":1.93465653722583,"d":"1.935 "},{"$f":"D62*E62/F62","v":{"v":1.57631235380568,"d":"1.58 "}},{"$f":"VLOOKUP(C62,'11.Region'!$B$22:$E$243,4,FALSE())","v":"Americas"},{"$f":"G62","v":{"v":1.57631235380568,"d":"1.58 "}}]
[null,null,"Costa Rica",{"v":1.12949,"d":"1.129 "},{"v":553.84983,"d":"553.850 "},{"v":390.705340687035,"d":"390.705 "},{"$f":"D63*E63/F63","v":{"v":1.60112437517919,"d":"1.60 "}},{"$f":"VLOOKUP(C63,'11.Region'!$B$22:$E$243,4,FALSE())","v":"Americas"},{"$f":"G63","v":{"v":1.60112437517919,"d":"1.60 "}}]
[null,null,"Grenada",{"v":1.12949,"d":"1.129 "},{"v":2.7,"d":"2.700 "},{"v":1.87721935292305,"d":"1.877 "},{"$f":"D64*E64/F64","v":{"v":1.62454270208294,"d":"1.62 "}},{"$f":"VLOOKUP(C64,'11.Region'!$B$22:$E$243,4,FALSE())","v":"Americas"},{"$f":"G64","v":{"v":1.62454270208294,"d":"1.62 "}}]
[null,null,"Argentina",{"v":1.12949,"d":"1.129 "},{"v":16.5321,"d":"17"},{"v":11.4735355191664,"d":"11.474 "},{"$f":"D65*E65/F65","v":{"v":1.62747059071785,"d":"1.63 "}},{"$f":"VLOOKUP(C65,'11.Region'!$B$22:$E$243,4,FALSE())","v":"Americas"},{"$f":"G65","v":{"v":1.62747059071785,"d":"1.63 "}}]
[null,null,"St. Lucia",{"v":1.12949,"d":"1.129 "},{"v":2.7,"d":"2.700 "},{"v":1.81800302884694,"d":"1.818 "},{"$f":"D66*E66/F66","v":{"v":1.67745760134086,"d":"1.68 "}},{"$f":"VLOOKUP(C66,'11.Region'!$B$22:$E$243,4,FALSE())","v":"Americas"},{"$f":"G66","v":{"v":1.67745760134086,"d":"1.68 "}}]
[null,null,"Chile",{"v":1.12949,"d":"1.129 "},{"v":645.82664,"d":"645.827 "},{"v":413.423606,"d":"413.424 "},{"$f":"D67*E67/F67","v":{"v":1.76442448139645,"d":"1.76 "}},{"$f":"VLOOKUP(C67,'11.Region'!$B$22:$E$243,4,FALSE())","v":"Americas"},{"$f":"G67","v":{"v":1.76442448139645,"d":"1.76 "}}]
[null,null,"Antigua and Barbuda",{"v":1.12949,"d":"1.129 "},{"v":2.7,"d":"2.700 "},{"v":1.71903062463935,"d":"1.719 "},{"$f":"D68*E68/F68","v":{"v":1.77403645769243,"d":"1.77 "}},{"$f":"VLOOKUP(C68,'11.Region'!$B$22:$E$243,4,FALSE())","v":"Americas"},{"$f":"G68","v":{"v":1.77403645769243,"d":"1.77 "}}]
[null,null,"Brazil",{"v":1.12949,"d":"1.129 "},{"v":3.19072,"d":"3.191 "},{"v":2.02434577683181,"d":"2.024 "},{"$f":"D69*E69/F69","v":{"v":1.78027211262309,"d":"1.78 "}},{"$f":"VLOOKUP(C69,'11.Region'!$B$22:$E$243,4,FALSE())","v":"Americas"},{"$f":"G69","v":{"v":1.78027211262309,"d":"1.78 "}}]
[null,null,"St. Kitts and Nevis",{"v":1.12949,"d":"1.129 "},{"v":2.7,"d":"2.700 "},{"v":1.70478903847639,"d":"1.705 "},{"$f":"D70*E70/F70","v":{"v":1.78885652779978,"d":"1.79 "}},{"$f":"VLOOKUP(C70,'11.Region'!$B$22:$E$243,4,FALSE())","v":"Americas"},{"$f":"G70","v":{"v":1.78885652779978,"d":"1.79 "}}]
[null,null,"Panama",{"v":1.12949,"d":"1.129 "},{"v":1,"d":"1.000 "},{"v":0.617184784399304,"d":"0.617 "},{"$f":"D71*E71/F71","v":{"v":1.83006779906169,"d":"1.83 "}},{"$f":"VLOOKUP(C71,'11.Region'!$B$22:$E$243,4,FALSE())","v":"Americas"},{"$f":"G71","v":{"v":1.83006779906169,"d":"1.83 "}}]
[null,null,"St. Vincent and the Grenadines",{"v":1.12949,"d":"1.129 "},{"v":2.7,"d":"2.700 "},{"v":1.64729847137889,"d":"1.647 "},{"$f":"D72*E72/F72","v":{"v":1.85128745821471,"d":"1.85 "}},{"$f":"VLOOKUP(C72,'11.Region'!$B$22:$E$243,4,FALSE())","v":"Americas"},{"$f":"G72","v":{"v":1.85128745821471,"d":"1.85 "}}]
[null,null,"Guyana",{"v":1.12949,"d":"1.129 "},{"v":198.80174,"d":"198.802 "},{"v":119.542572517499,"d":"119.543 "},{"$f":"D73*E73/F73","v":{"v":1.87836494216092,"d":"1.88 "}},{"$f":"VLOOKUP(C73,'11.Region'!$B$22:$E$243,4,FALSE())","v":"Americas"},{"$f":"G73","v":{"v":1.87836494216092,"d":"1.88 "}}]
[null,null,"Jamaica",{"v":1.12949,"d":"1.129 "},{"v":126.88546,"d":"126.885 "},{"v":72.6865919237836,"d":"72.687 "},{"$f":"D74*E74/F74","v":{"v":1.97169594036924,"d":"1.97 "}},{"$f":"VLOOKUP(C74,'11.Region'!$B$22:$E$243,4,FALSE())","v":"Americas"},{"$f":"G74","v":{"v":1.97169594036924,"d":"1.97 "}}]
[null,null,"Belize",{"v":1.12949,"d":"1.129 "},{"v":2,"d":"2.000 "},{"v":1.14214172621669,"d":"1.142 "},{"$f":"D75*E75/F75","v":{"v":1.97784561070438,"d":"1.98 "}},{"$f":"VLOOKUP(C75,'11.Region'!$B$22:$E$243,4,FALSE())","v":"Americas"},{"$f":"G75","v":{"v":1.97784561070438,"d":"1.98 "}}]
[null,null,"Guatemala",{"v":1.12949,"d":"1.129 "},{"v":7.18309,"d":"7.183 "},{"v":4.03083771439375,"d":"4.031 "},{"$f":"D76*E76/F76","v":{"v":2.01278962314171,"d":"2.01 "}},{"$f":"VLOOKUP(C76,'11.Region'!$B$22:$E$243,4,FALSE())","v":"Americas"},{"$f":"G76","v":{"v":2.01278962314171,"d":"2.01 "}}]
[null,null,"Ecuador",{"v":1.12949,"d":"1.129 "},{"v":1,"d":"1.000 "},{"v":0.533590297937366,"d":"0.534 "},{"$f":"D77*E77/F77","v":{"v":2.11677387007622,"d":"2.12 "}},{"$f":"VLOOKUP(C77,'11.Region'!$B$22:$E$243,4,FALSE())","v":"Americas"},{"$f":"G77","v":{"v":2.11677387007622,"d":"2.12 "}}]
[null,null,"Trinidad and Tobago",{"v":1.12949,"d":"1.129 "},{"v":6.62864,"d":"6.629 "},{"v":3.46221622700994,"d":"3.462 "},{"$f":"D78*E78/F78","v":{"v":2.1624826708371,"d":"2.16 "}},{"$f":"VLOOKUP(C78,'11.Region'!$B$22:$E$243,4,FALSE())","v":"Americas"},{"$f":"G78","v":{"v":2.1624826708371,"d":"2.16 "}}]
[null,null,"Honduras",{"v":1.12949,"d":"1.129 "},{"v":23.12483,"d":"23.125 "},{"v":11.6823631907139,"d":"11.682 "},{"$f":"D79*E79/F79","v":{"v":2.2357860143795,"d":"2.24 "}},{"$f":"VLOOKUP(C79,'11.Region'!$B$22:$E$243,4,FALSE())","v":"Americas"},{"$f":"G79","v":{"v":2.2357860143795,"d":"2.24 "}}]
[null,null,"Peru",{"v":1.12949,"d":"1.129 "},{"v":3.22299,"d":"3.223 "},{"v":1.59512337178714,"d":"1.595 "},{"$f":"D80*E80/F80","v":{"v":2.28216515379713,"d":"2.28 "}},{"$f":"VLOOKUP(C80,'11.Region'!$B$22:$E$243,4,FALSE())","v":"Americas"},{"$f":"G80","v":{"v":2.28216515379713,"d":"2.28 "}}]
[null,null,"Mexico",{"v":1.12949,"d":"1.129 "},{"v":18.90363,"d":"18.904 "},{"v":9.285451,"d":"9.285 "},{"$f":"D81*E81/F81","v":{"v":2.29945331128235,"d":"2.30 "}},{"$f":"VLOOKUP(C81,'11.Region'!$B$22:$E$243,4,FALSE())","v":"Americas"},{"$f":"G81","v":{"v":2.29945331128235,"d":"2.30 "}}]
[null,null,"El Salvador",{"v":1.12949,"d":"1.129 "},{"v":1,"d":"1.000 "},{"v":0.485795653310238,"d":"0.486 "},{"$f":"D82*E82/F82","v":{"v":2.32503109548962,"d":"2.33 "}},{"$f":"VLOOKUP(C82,'11.Region'!$B$22:$E$243,4,FALSE())","v":"Americas"},{"$f":"G82","v":{"v":2.32503109548962,"d":"2.33 "}}]
[null,null,"Bolivia",{"v":1.12949,"d":"1.129 "},{"v":6.77749,"d":"6.777 "},{"v":3.1022954198651,"d":"3.102 "},{"$f":"D83*E83/F83","v":{"v":2.46756228664802,"d":"2.47 "}},{"$f":"VLOOKUP(C83,'11.Region'!$B$22:$E$243,4,FALSE())","v":"Americas"},{"$f":"G83","v":{"v":2.46756228664802,"d":"2.47 "}}]
[null,null,"Paraguay",{"v":1.12949,"d":"1.129 "},{"v":5513.89016,"d":"5,513.890 "},{"v":2505.70901313975,"d":"2,505.709 "},{"$f":"D84*E84/F84","v":{"v":2.48547766885933,"d":"2.49 "}},{"$f":"VLOOKUP(C84,'11.Region'!$B$22:$E$243,4,FALSE())","v":"Americas"},{"$f":"G84","v":{"v":2.48547766885933,"d":"2.49 "}}]
[null,null,"Dominican Republic",{"v":1.12949,"d":"1.129 "},{"v":46.83891,"d":"46.839 "},{"v":20.9347456424888,"d":"20.935 "},{"$f":"D85*E85/F85","v":{"v":2.52709449445265,"d":"2.53 "}},{"$f":"VLOOKUP(C85,'11.Region'!$B$22:$E$243,4,FALSE())","v":"Americas"},{"$f":"G85","v":{"v":2.52709449445265,"d":"2.53 "}}]
[null,null,"Colombia",{"v":1.12949,"d":"1.129 "},{"v":2941.83494,"d":"2,941.835 "},{"v":1278.0404018831,"d":"1,278.040 "},{"$f":"D86*E86/F86","v":{"v":2.59989679628651,"d":"2.60 "}},{"$f":"VLOOKUP(C86,'11.Region'!$B$22:$E$243,4,FALSE())","v":"Americas"},{"$f":"G86","v":{"v":2.59989679628651,"d":"2.60 "}}]
[null,null,"Haiti",{"v":1.12949,"d":"1.129 "},{"v":64.11254,"d":"64.113 "},{"v":27.692046680367,"d":"27.692 "},{"$f":"D87*E87/F87","v":{"v":2.61499172092398,"d":"2.61 "}},{"$f":"VLOOKUP(C87,'11.Region'!$B$22:$E$243,4,FALSE())","v":"Americas"},{"$f":"G87","v":{"v":2.61499172092398,"d":"2.61 "}}]
[null,null,"Suriname",{"v":1.12949,"d":"1.129 "},{"v":7.4244,"d":"7.424 "},{"v":2.92316603381348,"d":"2.923 "},{"$f":"D88*E88/F88","v":{"v":2.86873392034463,"d":"2.87 "}},{"$f":"VLOOKUP(C88,'11.Region'!$B$22:$E$243,4,FALSE())","v":"Americas"},{"$f":"G88","v":{"v":2.86873392034463,"d":"2.87 "}}]
[null,null,"Nicaragua",{"v":1.12949,"d":"1.129 "},{"v":29.58264,"d":"29.583 "},{"v":11.4283896654604,"d":"11.428 "},{"$f":"D89*E89/F89","v":{"v":2.92370990416819,"d":"2.92 "}},{"$f":"VLOOKUP(C89,'11.Region'!$B$22:$E$243,4,FALSE())","v":"Americas"},{"$f":"G89","v":{"v":2.92370990416819,"d":"2.92 "}}]
[null,null,"Aruba",{"v":1.12949,"d":"1.129 "},{"v":1.78741,"d":"1.787 "},null,{"$f":"D90*E90/F90","v":{"$error":"#DIV/0!"}},{"$f":"VLOOKUP(C90,'11.Region'!$B$22:$E$243,4,FALSE())","v":"Americas"},{"$f":"$K$57","v":{"v":1.96289944979353,"d":"1.96 "}},"est"]
[null,null,"Bermuda",{"v":1.12949,"d":"1.129 "},{"v":1,"d":"1.000 "},null,{"$f":"D91*E91/F91","v":{"$error":"#DIV/0!"}},{"$f":"VLOOKUP(C91,'11.Region'!$B$22:$E$243,4,FALSE())","v":"Americas"},{"$f":"$K$57","v":{"v":1.96289944979353,"d":"1.96 "}},"est"]
[null,null,"Cuba",{"v":1.12949,"d":"1.129 "},null,null,{"$f":"D92*E92/F92","v":{"$error":"#DIV/0!"}},{"$f":"VLOOKUP(C92,'11.Region'!$B$22:$E$243,4,FALSE())","v":"Americas"},{"$f":"$K$57","v":{"v":1.96289944979353,"d":"1.96 "}},"est"]
[null,null,"Curacao",{"v":1.12949,"d":"1.129 "},null,null,{"$f":"D93*E93/F93","v":{"$error":"#DIV/0!"}},{"$f":"VLOOKUP(C93,'11.Region'!$B$22:$E$243,4,FALSE())","v":"Americas"},{"$f":"$K$57","v":{"v":1.96289944979353,"d":"1.96 "}},"est"]
[null,null,"Cayman Islands",{"v":1.12949,"d":"1.129 "},null,null,{"$f":"D94*E94/F94","v":{"$error":"#DIV/0!"}},{"$f":"VLOOKUP(C94,'11.Region'!$B$22:$E$243,4,FALSE())","v":"Americas"},{"$f":"$K$57","v":{"v":1.96289944979353,"d":"1.96 "}},"est"]
[null,null,"Greenland",{"v":1.12949,"d":"1.129 "},{"v":6.59736,"d":"6.597 "},null,{"$f":"D95*E95/F95","v":{"$error":"#DIV/0!"}},{"$f":"VLOOKUP(C95,'11.Region'!$B$22:$E$243,4,FALSE())","v":"Americas"},{"$f":"$K$57","v":{"v":1.96289944979353,"d":"1.96 "}},"est"]
[null,null,"St. Martin (French part)",{"v":1.12949,"d":"1.129 "},null,null,{"$f":"D96*E96/F96","v":{"$error":"#DIV/0!"}},{"$f":"VLOOKUP(C96,'11.Region'!$B$22:$E$243,4,FALSE())","v":"Americas"},{"$f":"$K$57","v":{"v":1.96289944979353,"d":"1.96 "}},"est"]
[null,null,"Puerto Rico",{"v":1.12949,"d":"1.129 "},null,null,{"$f":"D97*E97/F97","v":{"$error":"#DIV/0!"}},{"$f":"VLOOKUP(C97,'11.Region'!$B$22:$E$243,4,FALSE())","v":"Americas"},{"$f":"$K$57","v":{"v":1.96289944979353,"d":"1.96 "}},"est"]
[null,null,"Sint Maarten (Dutch part)",{"v":1.12949,"d":"1.129 "},null,null,{"$f":"D98*E98/F98","v":{"$error":"#DIV/0!"}},{"$f":"VLOOKUP(C98,'11.Region'!$B$22:$E$243,4,FALSE())","v":"Americas"},{"$f":"$K$57","v":{"v":1.96289944979353,"d":"1.96 "}},"est"]
[null,null,"Turks and Caicos Islands",{"v":1.12949,"d":"1.129 "},null,null,{"$f":"D99*E99/F99","v":{"$error":"#DIV/0!"}},{"$f":"VLOOKUP(C99,'11.Region'!$B$22:$E$243,4,FALSE())","v":"Americas"},{"$f":"$K$57","v":{"v":1.96289944979353,"d":"1.96 "}},"est"]
[null,null,"Venezuela, RB",{"v":1.12949,"d":"1.129 "},null,null,{"$f":"D100*E100/F100","v":{"$error":"#DIV/0!"}},{"$f":"VLOOKUP(C100,'11.Region'!$B$22:$E$243,4,FALSE())","v":"Americas"},{"$f":"$K$57","v":{"v":1.96289944979353,"d":"1.96 "}},"est"]
[null,null,"British Virgin Islands",{"v":1.12949,"d":"1.129 "},null,null,{"$f":"D101*E101/F101","v":{"$error":"#DIV/0!"}},{"$f":"VLOOKUP(C101,'11.Region'!$B$22:$E$243,4,FALSE())","v":"Americas"},{"$f":"$K$57","v":{"v":1.96289944979353,"d":"1.96 "}},"est"]
[null,null,"Virgin Islands (U.S.)",{"v":1.12949,"d":"1.129 "},null,null,{"$f":"D102*E102/F102","v":{"$error":"#DIV/0!"}},{"$f":"VLOOKUP(C102,'11.Region'!$B$22:$E$243,4,FALSE())","v":"Americas"},{"$f":"$K$57","v":{"v":1.96289944979353,"d":"1.96 "}},"est"]
[null,null,"West Bank and Gaza",{"v":1.12949,"d":"1.129 "},null,{"v":2.28021651476943,"d":"2.280 "},{"$f":"D103*E103/F103","v":0},{"$f":"VLOOKUP(C103,'11.Region'!$B$22:$E$243,4,FALSE())","v":"Asia"},{"$f":"$K$103","v":{"v":3.00272943672245,"d":"3.00 "}},"est",{"$f":"AVERAGE(G104:G149)","v":{"v":3.00272943672245,"d":"3.00 "}},"Asia"]
[null,null,"Israel",{"v":1.12949,"d":"1.129 "},{"v":3.59563,"d":"3.596 "},{"v":3.773624,"d":"3.774 "},{"$f":"D104*E104/F104","v":{"v":1.07621430452531,"d":"1.08 "}},{"$f":"VLOOKUP(C104,'11.Region'!$B$22:$E$243,4,FALSE())","v":"Asia"},{"$f":"G104","v":{"v":1.07621430452531,"d":"1.08 "}}]
[null,null,"Japan",{"v":1.12949,"d":"1.129 "},{"v":112.14867,"d":"112.149 "},{"v":98.239494,"d":"98.239 "},{"$f":"D105*E105/F105","v":{"v":1.28940812010188,"d":"1.29 "}},{"$f":"VLOOKUP(C105,'11.Region'!$B$22:$E$243,4,FALSE())","v":"Asia"},{"$f":"G105","v":{"v":1.28940812010188,"d":"1.29 "}}]
[null,null,"Korea, Rep.",{"v":1.12949,"d":"1.129 "},{"v":1128.64633,"d":"1,128.646 "},{"v":878.77373,"d":"878.774 "},{"$f":"D106*E106/F106","v":{"v":1.45065185695947,"d":"1.45 "}},{"$f":"VLOOKUP(C106,'11.Region'!$B$22:$E$243,4,FALSE())","v":"Asia"},{"$f":"G106","v":{"v":1.45065185695947,"d":"1.45 "}}]
[null,null,"Hong Kong SAR, China",{"v":1.12949,"d":"1.129 "},{"v":7.79206,"d":"7.792 "},{"v":5.84977495286962,"d":"5.850 "},{"$f":"D107*E107/F107","v":{"v":1.50451152741912,"d":"1.50 "}},{"$f":"VLOOKUP(C107,'11.Region'!$B$22:$E$243,4,FALSE())","v":"Asia"},{"$f":"G107","v":{"v":1.50451152741912,"d":"1.50 "}}]
[null,null,"Cyprus",{"v":1.12949,"d":"1.129 "},{"$f":"1/1.12949","v":{"v":0.885355337364651,"d":"0.885 "}},{"v":0.648986049082789,"d":"0.649 "},{"$f":"D108*E108/F108","v":{"v":1.54086517177572,"d":"1.54 "}},{"$f":"VLOOKUP(C108,'11.Region'!$B$22:$E$243,4,FALSE())","v":"Asia"},{"$f":"G108","v":{"v":1.54086517177572,"d":"1.54 "}}]
[null,null,"Macao SAR, China",{"v":1.12949,"d":"1.129 "},{"v":7.85523,"d":"7.855 "},{"v":5.63957978148747,"d":"5.640 "},{"$f":"D109*E109/F109","v":{"v":1.57323844620917,"d":"1.57 "}},{"$f":"VLOOKUP(C109,'11.Region'!$B$22:$E$243,4,FALSE())","v":"Asia"},{"$f":"G109","v":{"v":1.57323844620917,"d":"1.57 "}}]
[null,null,"Maldives",{"v":1.12949,"d":"1.129 "},{"v":15.22988,"d":"15.230 "},{"v":9.71242807945734,"d":"9.712 "},{"$f":"D110*E110/F110","v":{"v":1.77113251397802,"d":"1.77 "}},{"$f":"VLOOKUP(C110,'11.Region'!$B$22:$E$243,4,FALSE())","v":"Asia"},{"$f":"G110","v":{"v":1.77113251397802,"d":"1.77 "}}]
[null,null,"Singapore",{"v":1.12949,"d":"1.129 "},{"v":1.38069,"d":"1.381 "},{"v":0.848701477342586,"d":"0.849 "},{"$f":"D111*E111/F111","v":{"v":1.83748419171245,"d":"1.84 "}},{"$f":"VLOOKUP(C111,'11.Region'!$B$22:$E$243,4,FALSE())","v":"Asia"},{"$f":"G111","v":{"v":1.83748419171245,"d":"1.84 "}}]
[null,null,"Lebanon",{"v":1.12949,"d":"1.129 "},{"v":1485.82845,"d":"1,485.828 "},{"v":875.569899206042,"d":"875.570 "},{"$f":"D112*E112/F112","v":{"v":1.91672689697567,"d":"1.92 "}},{"$f":"VLOOKUP(C112,'11.Region'!$B$22:$E$243,4,FALSE())","v":"Asia"},{"$f":"G112","v":{"v":1.91672689697567,"d":"1.92 "}}]
[null,null,"United Arab Emirates",{"v":1.12949,"d":"1.129 "},{"v":3.67215,"d":"3.672 "},{"v":2.02314055652801,"d":"2.023 "},{"$f":"D113*E113/F113","v":{"v":2.05010803135594,"d":"2.05 "}},{"$f":"VLOOKUP(C113,'11.Region'!$B$22:$E$243,4,FALSE())","v":"Asia"},{"$f":"G113","v":{"v":2.05010803135594,"d":"2.05 "}}]
[null,null,"China",{"v":1.12949,"d":"1.129 "},{"v":6.75821,"d":"6.758 "},{"v":3.54975926880731,"d":"3.550 "},{"$f":"D114*E114/F114","v":{"v":2.15037979616706,"d":"2.15 "}},{"$f":"VLOOKUP(C114,'11.Region'!$B$22:$E$243,4,FALSE())","v":"Asia"},{"$f":"G114","v":{"v":2.15037979616706,"d":"2.15 "}}]
[null,null,"Bahrain",{"v":1.12949,"d":"1.129 "},{"v":0.37405,"d":"0.374 "},{"v":0.18714228331906,"d":"0.187 "},{"$f":"D115*E115/F115","v":{"v":2.25756428214409,"d":"2.26 "}},{"$f":"VLOOKUP(C115,'11.Region'!$B$22:$E$243,4,FALSE())","v":"Asia"},{"$f":"G115","v":{"v":2.25756428214409,"d":"2.26 "}}]
[null,null,"Qatar",{"v":1.12949,"d":"1.129 "},{"v":3.62749,"d":"3.627 "},{"v":1.80062463601717,"d":"1.801 "},{"$f":"D116*E116/F116","v":{"v":2.27544019899822,"d":"2.28 "}},{"$f":"VLOOKUP(C116,'11.Region'!$B$22:$E$243,4,FALSE())","v":"Asia"},{"$f":"G116","v":{"v":2.27544019899822,"d":"2.28 "}}]
[null,null,"Jordan",{"v":1.12949,"d":"1.129 "},{"v":0.70691,"d":"0.707 "},{"v":0.320333310891471,"d":"0.320 "},{"$f":"D117*E117/F117","v":{"v":2.49255306504953,"d":"2.49 "}},{"$f":"VLOOKUP(C117,'11.Region'!$B$22:$E$243,4,FALSE())","v":"Asia"},{"$f":"G117","v":{"v":2.49255306504953,"d":"2.49 "}}]
[null,null,"Armenia",{"v":1.12949,"d":"1.129 "},{"v":466.05248,"d":"466.052 "},{"v":196.97951259923,"d":"196.980 "},{"$f":"D118*E118/F118","v":{"v":2.67236733754238,"d":"2.67 "}},{"$f":"VLOOKUP(C118,'11.Region'!$B$22:$E$243,4,FALSE())","v":"Asia"},{"$f":"G118","v":{"v":2.67236733754238,"d":"2.67 "}}]
[null,null,"Turkmenistan",{"v":1.12949,"d":"1.129 "},{"v":3.41141,"d":"3.411 "},{"v":1.43087554470926,"d":"1.431 "},{"$f":"D119*E119/F119","v":{"v":2.69286416638208,"d":"2.69 "}},{"$f":"VLOOKUP(C119,'11.Region'!$B$22:$E$243,4,FALSE())","v":"Asia"},{"$f":"G119","v":{"v":2.69286416638208,"d":"2.69 "}}]
[null,null,"Kuwait",{"v":1.12949,"d":"1.129 "},{"v":0.30281,"d":"0.303 "},{"v":0.122429440333495,"d":"0.122 "},{"$f":"D120*E120/F120","v":{"v":2.79361619205596,"d":"2.79 "}},{"$f":"VLOOKUP(C120,'11.Region'!$B$22:$E$243,4,FALSE())","v":"Asia"},{"$f":"G120","v":{"v":2.79361619205596,"d":"2.79 "}}]
[null,null,"Bangladesh",{"v":1.12949,"d":"1.129 "},{"v":79.9389,"d":"79.939 "},{"v":31.0137123469418,"d":"31.014 "},{"$f":"D121*E121/F121","v":{"v":2.91129894902451,"d":"2.91 "}},{"$f":"VLOOKUP(C121,'11.Region'!$B$22:$E$243,4,FALSE())","v":"Asia"},{"$f":"G121","v":{"v":2.91129894902451,"d":"2.91 "}}]
[null,null,"Saudi Arabia",{"v":1.12949,"d":"1.129 "},{"v":3.74786,"d":"3.748 "},{"v":1.44588687728558,"d":"1.446 "},{"$f":"D122*E122/F122","v":{"v":2.92773276934852,"d":"2.93 "}},{"$f":"VLOOKUP(C122,'11.Region'!$B$22:$E$243,4,FALSE())","v":"Asia"},{"$f":"G122","v":{"v":2.92773276934852,"d":"2.93 "}}]
[null,null,"Georgia",{"v":1.12949,"d":"1.129 "},{"v":2.49198,"d":"2.492 "},{"v":0.956602102936769,"d":"0.957 "},{"$f":"D123*E123/F123","v":{"v":2.94235866883313,"d":"2.94 "}},{"$f":"VLOOKUP(C123,'11.Region'!$B$22:$E$243,4,FALSE())","v":"Asia"},{"$f":"G123","v":{"v":2.94235866883313,"d":"2.94 "}}]
[null,null,"Turkey",{"v":1.12949,"d":"1.129 "},{"v":3.64328,"d":"3.643 "},{"v":1.37744,"d":"1.377 "},{"$f":"D124*E124/F124","v":{"v":2.98746103438262,"d":"2.99 "}},{"$f":"VLOOKUP(C124,'11.Region'!$B$22:$E$243,4,FALSE())","v":"Asia"},{"$f":"G124","v":{"v":2.98746103438262,"d":"2.99 "}}]
[null,null,"Oman",{"v":1.12949,"d":"1.129 "},{"v":0.38382,"d":"0.384 "},{"v":0.144557583109135,"d":"0.145 "},{"$f":"D125*E125/F125","v":{"v":2.99894922477162,"d":"3.00 "}},{"$f":"VLOOKUP(C125,'11.Region'!$B$22:$E$243,4,FALSE())","v":"Asia"},{"$f":"G125","v":{"v":2.99894922477162,"d":"3.00 "}}]
[null,null,"Thailand",{"v":1.12949,"d":"1.129 "},{"v":33.86704,"d":"33.867 "},{"v":12.5230239086361,"d":"12.523 "},{"$f":"D126*E126/F126","v":{"v":3.0545723851266,"d":"3.05 "}},{"$f":"VLOOKUP(C126,'11.Region'!$B$22:$E$243,4,FALSE())","v":"Asia"},{"$f":"G126","v":{"v":3.0545723851266,"d":"3.05 "}}]
[null,null,"Brunei Darussalam",{"v":1.12949,"d":"1.129 "},{"v":1.36779,"d":"1.368 "},{"v":0.495540201325653,"d":"0.496 "},{"$f":"D127*E127/F127","v":{"v":3.11761815281005,"d":"3.12 "}},{"$f":"VLOOKUP(C127,'11.Region'!$B$22:$E$243,4,FALSE())","v":"Asia"},{"$f":"G127","v":{"v":3.11761815281005,"d":"3.12 "}}]
[null,null,"Lao PDR",{"v":1.12949,"d":"1.129 "},{"v":8103.40882,"d":"8,103.409 "},{"v":2922.07967169755,"d":"2,922.080 "},{"$f":"D128*E128/F128","v":{"v":3.13226203814786,"d":"3.13 "}},{"$f":"VLOOKUP(C128,'11.Region'!$B$22:$E$243,4,FALSE())","v":"Asia"},{"$f":"G128","v":{"v":3.13226203814786,"d":"3.13 "}}]
[null,null,"Philippines",{"v":1.12949,"d":"1.129 "},{"v":50.32458,"d":"50.325 "},{"v":18.0579894621743,"d":"18.058 "},{"$f":"D129*E129/F129","v":{"v":3.14769869498838,"d":"3.15 "}},{"$f":"VLOOKUP(C129,'11.Region'!$B$22:$E$243,4,FALSE())","v":"Asia"},{"$f":"G129","v":{"v":3.14769869498838,"d":"3.15 "}}]
[null,null,"Cambodia",{"v":1.12949,"d":"1.129 "},{"v":3982.28455,"d":"3,982.285 "},{"v":1401.31376937768,"d":"1,401.314 "},{"$f":"D130*E130/F130","v":{"v":3.20980973331692,"d":"3.21 "}},{"$f":"VLOOKUP(C130,'11.Region'!$B$22:$E$243,4,FALSE())","v":"Asia"},{"$f":"G130","v":{"v":3.20980973331692,"d":"3.21 "}}]
[null,null,"Vietnam",{"v":1.12949,"d":"1.129 "},{"v":22456.29963,"d":"22,456.300 "},{"v":7735.71397952574,"d":"7,735.714 "},{"$f":"D131*E131/F131","v":{"v":3.27883966964401,"d":"3.28 "}},{"$f":"VLOOKUP(C131,'11.Region'!$B$22:$E$243,4,FALSE())","v":"Asia"},{"$f":"G131","v":{"v":3.27883966964401,"d":"3.28 "}}]
[null,null,"Bhutan",{"v":1.12949,"d":"1.129 "},{"v":65.08933,"d":"65.089 "},{"v":22.1211836656578,"d":"22.121 "},{"$f":"D132*E132/F132","v":{"v":3.32340929187407,"d":"3.32 "}},{"$f":"VLOOKUP(C132,'11.Region'!$B$22:$E$243,4,FALSE())","v":"Asia"},{"$f":"G132","v":{"v":3.32340929187407,"d":"3.32 "}}]
[null,null,"Malaysia",{"v":1.12949,"d":"1.129 "},{"v":4.29819,"d":"4.298 "},{"v":1.45310673411807,"d":"1.453 "},{"$f":"D133*E133/F133","v":{"v":3.34095390869308,"d":"3.34 "}},{"$f":"VLOOKUP(C133,'11.Region'!$B$22:$E$243,4,FALSE())","v":"Asia"},{"$f":"G133","v":{"v":3.34095390869308,"d":"3.34 "}}]
[null,null,"Kazakhstan",{"v":1.12949,"d":"1.129 "},{"v":324.40776,"d":"324.408 "},{"v":109.090116267495,"d":"109.090 "},{"$f":"D134*E134/F134","v":{"v":3.35883151819116,"d":"3.36 "}},{"$f":"VLOOKUP(C134,'11.Region'!$B$22:$E$243,4,FALSE())","v":"Asia"},{"$f":"G134","v":{"v":3.35883151819116,"d":"3.36 "}}]
[null,null,"Kyrgyz Republic",{"v":1.12949,"d":"1.129 "},{"v":68.86368,"d":"68.864 "},{"v":22.5484718277065,"d":"22.548 "},{"$f":"D135*E135/F135","v":{"v":3.44949487120571,"d":"3.45 "}},{"$f":"VLOOKUP(C135,'11.Region'!$B$22:$E$243,4,FALSE())","v":"Asia"},{"$f":"G135","v":{"v":3.44949487120571,"d":"3.45 "}}]
[null,null,"Nepal",{"v":1.12949,"d":"1.129 "},{"v":102.71526,"d":"102.715 "},{"v":33.0727378505397,"d":"33.073 "},{"$f":"D136*E136/F136","v":{"v":3.5079000577966,"d":"3.51 "}},{"$f":"VLOOKUP(C136,'11.Region'!$B$22:$E$243,4,FALSE())","v":"Asia"},{"$f":"G136","v":{"v":3.5079000577966,"d":"3.51 "}}]
[null,null,"Sri Lanka",{"v":1.12949,"d":"1.129 "},{"v":150.55943,"d":"150.559 "},{"v":48.3749334212568,"d":"48.375 "},{"$f":"D137*E137/F137","v":{"v":3.51536133620754,"d":"3.52 "}},{"$f":"VLOOKUP(C137,'11.Region'!$B$22:$E$243,4,FALSE())","v":"Asia"},{"$f":"G137","v":{"v":3.51536133620754,"d":"3.52 "}}]
[null,null,"Timor-Leste",{"v":1.12949,"d":"1.129 "},{"v":1,"d":"1.000 "},{"v":0.315991655157823,"d":"0.316 "},{"$f":"D138*E138/F138","v":{"v":3.57442983561029,"d":"3.57 "}},{"$f":"VLOOKUP(C138,'11.Region'!$B$22:$E$243,4,FALSE())","v":"Asia"},{"$f":"G138","v":{"v":3.57442983561029,"d":"3.57 "}}]
[null,null,"Indonesia",{"v":1.12949,"d":"1.129 "},{"v":13337.40336,"d":"13,337.403 "},{"v":4190.49247026961,"d":"4,190.492 "},{"$f":"D139*E139/F139","v":{"v":3.59491487646491,"d":"3.59 "}},{"$f":"VLOOKUP(C139,'11.Region'!$B$22:$E$243,4,FALSE())","v":"Asia"},{"$f":"G139","v":{"v":3.59491487646491,"d":"3.59 "}}]
[null,null,"Iraq",{"v":1.12949,"d":"1.129 "},{"v":1155.55961,"d":"1,155.560 "},{"v":355.059131057793,"d":"355.059 "},{"$f":"D140*E140/F140","v":{"v":3.67598777141843,"d":"3.68 "}},{"$f":"VLOOKUP(C140,'11.Region'!$B$22:$E$243,4,FALSE())","v":"Asia"},{"$f":"G140","v":{"v":3.67598777141843,"d":"3.68 "}}]
[null,null,"Afghanistan",{"v":1.12949,"d":"1.129 "},{"v":67.55338,"d":"67.553 "},{"v":20.2050508246696,"d":"20.205 "},{"$f":"D141*E141/F141","v":{"v":3.77632641651362,"d":"3.78 "}},{"$f":"VLOOKUP(C141,'11.Region'!$B$22:$E$243,4,FALSE())","v":"Asia"},{"$f":"G141","v":{"v":3.77632641651362,"d":"3.78 "}}]
[null,null,"Mongolia",{"v":1.12949,"d":"1.129 "},{"v":2431.0015,"d":"2,431.002 "},{"v":701.023002040352,"d":"701.023 "},{"$f":"D142*E142/F142","v":{"v":3.91683564767957,"d":"3.92 "}},{"$f":"VLOOKUP(C142,'11.Region'!$B$22:$E$243,4,FALSE())","v":"Asia"},{"$f":"G142","v":{"v":3.91683564767957,"d":"3.92 "}}]
[null,null,"Pakistan",{"v":1.12949,"d":"1.129 "},{"v":104.36447,"d":"104.364 "},{"v":29.3509185684774,"d":"29.351 "},{"$f":"D143*E143/F143","v":{"v":4.01618180859595,"d":"4.02 "}},{"$f":"VLOOKUP(C143,'11.Region'!$B$22:$E$243,4,FALSE())","v":"Asia"},{"$f":"G143","v":{"v":4.01618180859595,"d":"4.02 "}}]
[null,null,"India",{"v":1.12949,"d":"1.129 "},{"v":65.04837,"d":"65.048 "},{"v":17.7291702330434,"d":"17.729 "},{"$f":"D144*E144/F144","v":{"v":4.14410163958857,"d":"4.14 "}},{"$f":"VLOOKUP(C144,'11.Region'!$B$22:$E$243,4,FALSE())","v":"Asia"},{"$f":"G144","v":{"v":4.14410163958857,"d":"4.14 "}}]
[null,null,"Iran, Islamic Rep.",{"v":1.12949,"d":"1.129 "},{"v":32929.17725,"d":"32,929.177 "},{"v":8720.1654729432,"d":"8,720.165 "},{"$f":"D145*E145/F145","v":{"v":4.2651915869607,"d":"4.27 "}},{"$f":"VLOOKUP(C145,'11.Region'!$B$22:$E$243,4,FALSE())","v":"Asia"},{"$f":"G145","v":{"v":4.2651915869607,"d":"4.27 "}}]
[null,null,"Tajikistan",{"v":1.12949,"d":"1.129 "},{"v":8.49174,"d":"8.492 "},{"v":2.15320399243974,"d":"2.153 "},{"$f":"D146*E146/F146","v":{"v":4.45444809050921,"d":"4.45 "}},{"$f":"VLOOKUP(C146,'11.Region'!$B$22:$E$243,4,FALSE())","v":"Asia"},{"$f":"G146","v":{"v":4.45444809050921,"d":"4.45 "}}]
[null,null,"Azerbaijan",{"v":1.12949,"d":"1.129 "},{"v":1.71207,"d":"1.712 "},{"v":0.408740923102119,"d":"0.409 "},{"$f":"D147*E147/F147","v":{"v":4.73103091714864,"d":"4.73 "}},{"$f":"VLOOKUP(C147,'11.Region'!$B$22:$E$243,4,FALSE())","v":"Asia"},{"$f":"G147","v":{"v":4.73103091714864,"d":"4.73 "}}]
[null,null,"Uzbekistan",{"v":1.12949,"d":"1.129 "},{"v":5070.34508,"d":"5,070.345 "},{"v":1120.52942618577,"d":"1,120.529 "},{"$f":"D148*E148/F148","v":{"v":5.11089127208673,"d":"5.11 "}},{"$f":"VLOOKUP(C148,'11.Region'!$B$22:$E$243,4,FALSE())","v":"Asia"},{"$f":"G148","v":{"v":5.11089127208673,"d":"5.11 "}}]
[null,null,"Myanmar",{"v":1.12949,"d":"1.129 "},{"v":1342.909,"d":"1,342.909 "},{"v":285.352660001551,"d":"285.353 "},{"$f":"D149*E149/F149","v":{"v":5.31553582294189,"d":"5.32 "}},{"$f":"VLOOKUP(C149,'11.Region'!$B$22:$E$243,4,FALSE())","v":"Asia"},{"$f":"G149","v":{"v":5.31553582294189,"d":"5.32 "}}]
[null,null,"Korea, Dem. People’s Rep.",{"v":1.12949,"d":"1.129 "},null,null,{"$f":"D150*E150/F150","v":{"$error":"#DIV/0!"}},{"$f":"VLOOKUP(C150,'11.Region'!$B$22:$E$243,4,FALSE())","v":"Asia"},{"$f":"$K$103","v":{"v":3.00272943672245,"d":"3.00 "}},"est"]
[null,null,"Syrian Arab Republic",{"v":1.12949,"d":"1.129 "},null,null,{"$f":"D151*E151/F151","v":{"$error":"#DIV/0!"}},{"$f":"VLOOKUP(C151,'11.Region'!$B$22:$E$243,4,FALSE())","v":"Asia"},{"$f":"$K$103","v":{"v":3.00272943672245,"d":"3.00 "}},"est"]
[null,null,"Yemen, Rep.",{"v":1.12949,"d":"1.129 "},null,{"v":0,"d":"-.0 "},{"$f":"D152*E152/F152","v":{"$error":"#DIV/0!"}},{"$f":"VLOOKUP(C152,'11.Region'!$B$22:$E$243,4,FALSE())","v":"Asia"},{"$f":"$K$103","v":{"v":3.00272943672245,"d":"3.00 "}},"est"]
[null,null,"Norway",{"v":1.12949,"d":"1.129 "},{"v":8.26494,"d":"8.265 "},{"v":10.242149,"d":"10.242 "},{"$f":"D153*E153/F153","v":{"v":0.91144613113908,"d":"0.91 "}},{"$f":"VLOOKUP(C153,'11.Region'!$B$22:$E$243,4,FALSE())","v":"Europe"},{"$f":"G153","v":{"v":0.91144613113908,"d":"0.91 "}},null,{"$f":"AVERAGE(G153:G193)","v":{"v":1.93286164519776,"d":"1.93 "}},"Europe"]
[null,null,"Poland",{"v":1.12949,"d":"1.129 "},{"v":3.77408,"d":"3.774 "},{"v":1.782042,"d":"1.782 "},{"$f":"D154*E154/F154","v":{"v":2.39207920980538,"d":"2.39 "}},{"$f":"VLOOKUP(C154,'11.Region'!$B$22:$E$243,4,FALSE())","v":"Europe"},{"$f":"G154","v":{"v":2.39207920980538,"d":"2.39 "}}]
[null,null,"Malta",{"v":1.12949,"d":"1.129 "},{"v":0.38078,"d":"0.381 "},{"v":0.604828995795813,"d":"0.605 "},{"$f":"D155*E155/F155","v":{"v":0.711088927927647,"d":"0.71 "}},{"$f":"VLOOKUP(C155,'11.Region'!$B$22:$E$243,4,FALSE())","v":"Europe"},{"$f":"G155","v":{"v":0.711088927927647,"d":"0.71 "}}]
[null,null,"Iceland",{"v":1.12949,"d":"1.129 "},{"v":106.39519,"d":"106.395 "},{"v":139.862226,"d":"139.862 "},{"$f":"D156*E156/F156","v":{"v":0.859219151517723,"d":"0.86 "}},{"$f":"VLOOKUP(C156,'11.Region'!$B$22:$E$243,4,FALSE())","v":"Europe"},{"$f":"G156","v":{"v":0.859219151517723,"d":"0.86 "}}]
[null,null,"Switzerland",{"v":1.12949,"d":"1.129 "},{"v":0.98443,"d":"0.984 "},{"v":1.21468,"d":"1.215 "},{"$f":"D157*E157/F157","v":{"v":0.915388283910166,"d":"0.92 "}},{"$f":"VLOOKUP(C157,'11.Region'!$B$22:$E$243,4,FALSE())","v":"Europe"},{"$f":"G157","v":{"v":0.915388283910166,"d":"0.92 "}}]
[null,null,"Denmark",{"v":1.12949,"d":"1.129 "},{"v":6.59736,"d":"6.597 "},{"v":7.356282,"d":"7.356 "},{"$f":"D158*E158/F158","v":{"v":1.01296444948685,"d":"1.01 "}},{"$f":"VLOOKUP(C158,'11.Region'!$B$22:$E$243,4,FALSE())","v":"Europe"},{"$f":"G158","v":{"v":1.01296444948685,"d":"1.01 "}}]
[null,null,"Sweden",{"v":1.12949,"d":"1.129 "},{"v":8.54095,"d":"8.541 "},{"v":9.124655,"d":"9.125 "},{"$f":"D159*E159/F159","v":{"v":1.05723642324011,"d":"1.06 "}},{"$f":"VLOOKUP(C159,'11.Region'!$B$22:$E$243,4,FALSE())","v":"Europe"},{"$f":"G159","v":{"v":1.05723642324011,"d":"1.06 "}}]
[null,null,"Finland",{"v":1.12949,"d":"1.129 "},{"$f":"1/1.12949","v":{"v":0.885355337364651,"d":"0.885 "}},{"v":0.897446,"d":"0.897 "},{"$f":"D160*E160/F160","v":{"v":1.11427317075345,"d":"1.11 "}},{"$f":"VLOOKUP(C160,'11.Region'!$B$22:$E$243,4,FALSE())","v":"Europe"},{"$f":"G160","v":{"v":1.11427317075345,"d":"1.11 "}}]
[null,null,"Luxembourg",{"v":1.12949,"d":"1.129 "},{"$f":"1/1.12949","v":{"v":0.885355337364651,"d":"0.885 "}},{"v":0.891175,"d":"0.891 "},{"$f":"D161*E161/F161","v":{"v":1.12211406289449,"d":"1.12 "}},{"$f":"VLOOKUP(C161,'11.Region'!$B$22:$E$243,4,FALSE())","v":"Europe"},{"$f":"G161","v":{"v":1.12211406289449,"d":"1.12 "}}]
[null,null,"Belgium",{"v":1.12949,"d":"1.129 "},{"$f":"1/1.12949","v":{"v":0.885355337364651,"d":"0.885 "}},{"v":0.808339,"d":"0.808 "},{"$f":"D162*E162/F162","v":{"v":1.23710472957509,"d":"1.24 "}},{"$f":"VLOOKUP(C162,'11.Region'!$B$22:$E$243,4,FALSE())","v":"Europe"},{"$f":"G162","v":{"v":1.23710472957509,"d":"1.24 "}}]
[null,null,"Netherlands",{"v":1.12949,"d":"1.129 "},{"$f":"1/1.12949","v":{"v":0.885355337364651,"d":"0.885 "}},{"v":0.808315,"d":"0.808 "},{"$f":"D163*E163/F163","v":{"v":1.23714146094035,"d":"1.24 "}},{"$f":"VLOOKUP(C163,'11.Region'!$B$22:$E$243,4,FALSE())","v":"Europe"},{"$f":"G163","v":{"v":1.23714146094035,"d":"1.24 "}}]
[null,null,"Ireland",{"v":1.12949,"d":"1.129 "},{"$f":"1/1.12949","v":{"v":0.885355337364651,"d":"0.885 "}},{"v":0.806292,"d":"0.806 "},{"$f":"D164*E164/F164","v":{"v":1.2402454693833,"d":"1.24 "}},{"$f":"VLOOKUP(C164,'11.Region'!$B$22:$E$243,4,FALSE())","v":"Europe"},{"$f":"G164","v":{"v":1.2402454693833,"d":"1.24 "}}]
[null,null,"United Kingdom",{"v":1.12949,"d":"1.129 "},{"v":0.77667,"d":"0.777 "},{"v":0.703402,"d":"0.703 "},{"$f":"D165*E165/F165","v":{"v":1.2471403241674,"d":"1.25 "}},{"$f":"VLOOKUP(C165,'11.Region'!$B$22:$E$243,4,FALSE())","v":"Europe"},{"$f":"G165","v":{"v":1.2471403241674,"d":"1.25 "}}]
[null,null,"Austria",{"v":1.12949,"d":"1.129 "},{"$f":"1/1.12949","v":{"v":0.885355337364651,"d":"0.885 "}},{"v":0.798475,"d":"0.798 "},{"$f":"D166*E166/F166","v":{"v":1.2523873634115,"d":"1.25 "}},{"$f":"VLOOKUP(C166,'11.Region'!$B$22:$E$243,4,FALSE())","v":"Europe"},{"$f":"G166","v":{"v":1.2523873634115,"d":"1.25 "}}]
[null,null,"France",{"v":1.12949,"d":"1.129 "},{"$f":"1/1.12949","v":{"v":0.885355337364651,"d":"0.885 "}},{"v":0.798152,"d":"0.798 "},{"$f":"D167*E167/F167","v":{"v":1.25289418556866,"d":"1.25 "}},{"$f":"VLOOKUP(C167,'11.Region'!$B$22:$E$243,4,FALSE())","v":"Europe"},{"$f":"G167","v":{"v":1.25289418556866,"d":"1.25 "}}]
[null,null,"Germany",{"v":1.12949,"d":"1.129 "},{"$f":"1/1.12949","v":{"v":0.885355337364651,"d":"0.885 "}},{"v":0.778114,"d":"0.778 "},{"$f":"D168*E168/F168","v":{"v":1.28515872995474,"d":"1.29 "}},{"$f":"VLOOKUP(C168,'11.Region'!$B$22:$E$243,4,FALSE())","v":"Europe"},{"$f":"G168","v":{"v":1.28515872995474,"d":"1.29 "}}]
[null,null,"Italy",{"v":1.12949,"d":"1.129 "},{"$f":"1/1.12949","v":{"v":0.885355337364651,"d":"0.885 "}},{"v":0.71213,"d":"0.712 "},{"$f":"D169*E169/F169","v":{"v":1.40423799025459,"d":"1.40 "}},{"$f":"VLOOKUP(C169,'11.Region'!$B$22:$E$243,4,FALSE())","v":"Europe"},{"$f":"G169","v":{"v":1.40423799025459,"d":"1.40 "}}]
[null,null,"San Marino",{"v":1.12949,"d":"1.129 "},{"$f":"1/1.12949","v":{"v":0.885355337364651,"d":"0.885 "}},{"v":0.705989738864538,"d":"0.706 "},{"$f":"D170*E170/F170","v":{"v":1.41645118186608,"d":"1.42 "}},{"$f":"VLOOKUP(C170,'11.Region'!$B$22:$E$243,4,FALSE())","v":"Europe"},{"$f":"G170","v":{"v":1.41645118186608,"d":"1.42 "}}]
[null,null,"Spain",{"v":1.12949,"d":"1.129 "},{"$f":"1/1.12949","v":{"v":0.885355337364651,"d":"0.885 "}},{"v":0.655964,"d":"0.656 "},{"$f":"D171*E171/F171","v":{"v":1.52447390405571,"d":"1.52 "}},{"$f":"VLOOKUP(C171,'11.Region'!$B$22:$E$243,4,FALSE())","v":"Europe"},{"$f":"G171","v":{"v":1.52447390405571,"d":"1.52 "}}]
[null,null,"Slovenia",{"v":1.12949,"d":"1.129 "},{"$f":"1/1.12949","v":{"v":0.885355337364651,"d":"0.885 "}},{"v":0.601701,"d":"0.602 "},{"$f":"D172*E172/F172","v":{"v":1.66195502417314,"d":"1.66 "}},{"$f":"VLOOKUP(C172,'11.Region'!$B$22:$E$243,4,FALSE())","v":"Europe"},{"$f":"G172","v":{"v":1.66195502417314,"d":"1.66 "}}]
[null,null,"Greece",{"v":1.12949,"d":"1.129 "},{"$f":"1/1.12949","v":{"v":0.885355337364651,"d":"0.885 "}},{"v":0.593954,"d":"0.594 "},{"$f":"D173*E173/F173","v":{"v":1.68363206578287,"d":"1.68 "}},{"$f":"VLOOKUP(C173,'11.Region'!$B$22:$E$243,4,FALSE())","v":"Europe"},{"$f":"G173","v":{"v":1.68363206578287,"d":"1.68 "}}]
[null,null,"Portugal",{"v":1.12949,"d":"1.129 "},{"$f":"1/1.12949","v":{"v":0.885355337364651,"d":"0.885 "}},{"v":0.582515,"d":"0.583 "},{"$f":"D174*E174/F174","v":{"v":1.71669399071269,"d":"1.72 "}},{"$f":"VLOOKUP(C174,'11.Region'!$B$22:$E$243,4,FALSE())","v":"Europe"},{"$f":"G174","v":{"v":1.71669399071269,"d":"1.72 "}}]
[null,null,"Estonia",{"v":1.12949,"d":"1.129 "},{"$f":"1/1.12949","v":{"v":0.885355337364651,"d":"0.885 "}},{"v":0.552691,"d":"0.553 "},{"$f":"D175*E175/F175","v":{"v":1.80932926354871,"d":"1.81 "}},{"$f":"VLOOKUP(C175,'11.Region'!$B$22:$E$243,4,FALSE())","v":"Europe"},{"$f":"G175","v":{"v":1.80932926354871,"d":"1.81 "}}]
[null,null,"Latvia",{"v":1.12949,"d":"1.129 "},{"$f":"1/1.12949","v":{"v":0.885355337364651,"d":"0.885 "}},{"v":0.501419094863328,"d":"0.501 "},{"$f":"D176*E176/F176","v":{"v":1.99433968559289,"d":"1.99 "}},{"$f":"VLOOKUP(C176,'11.Region'!$B$22:$E$243,4,FALSE())","v":"Europe"},{"$f":"G176","v":{"v":1.99433968559289,"d":"1.99 "}}]
[null,null,"Czech Republic",{"v":1.12949,"d":"1.129 "},{"v":23.36203,"d":"23.362 "},{"v":12.897748,"d":"12.898 "},{"$f":"D177*E177/F177","v":{"v":2.04587492829756,"d":"2.05 "}},{"$f":"VLOOKUP(C177,'11.Region'!$B$22:$E$243,4,FALSE())","v":"Europe"},{"$f":"G177","v":{"v":2.04587492829756,"d":"2.05 "}}]
[null,null,"Slovak Republic",{"v":1.12949,"d":"1.129 "},{"$f":"1/1.12949","v":{"v":0.885355337364651,"d":"0.885 "}},{"v":0.486526,"d":"0.487 "},{"$f":"D178*E178/F178","v":{"v":2.05538861232493,"d":"2.06 "}},{"$f":"VLOOKUP(C178,'11.Region'!$B$22:$E$243,4,FALSE())","v":"Europe"},{"$f":"G178","v":{"v":2.05538861232493,"d":"2.06 "}}]
[null,null,"Croatia",{"v":1.12949,"d":"1.129 "},{"v":6.61403,"d":"6.614 "},{"v":3.48553992522658,"d":"3.486 "},{"$f":"D179*E179/F179","v":{"v":2.14327791531878,"d":"2.14 "}},{"$f":"VLOOKUP(C179,'11.Region'!$B$22:$E$243,4,FALSE())","v":"Europe"},{"$f":"G179","v":{"v":2.14327791531878,"d":"2.14 "}}]
[null,null,"Lithuania",{"v":1.12949,"d":"1.129 "},{"$f":"1/1.12949","v":{"v":0.885355337364651,"d":"0.885 "}},{"v":0.461241471610829,"d":"0.461 "},{"$f":"D180*E180/F180","v":{"v":2.16806176709918,"d":"2.17 "}},{"$f":"VLOOKUP(C180,'11.Region'!$B$22:$E$243,4,FALSE())","v":"Europe"},{"$f":"G180","v":{"v":2.16806176709918,"d":"2.17 "}}]
[null,null,"Hungary",{"v":1.12949,"d":"1.129 "},{"v":274.10039,"d":"274.100 "},{"v":137.576062,"d":"137.576 "},{"$f":"D181*E181/F181","v":{"v":2.25034533624825,"d":"2.25 "}},{"$f":"VLOOKUP(C181,'11.Region'!$B$22:$E$243,4,FALSE())","v":"Europe"},{"$f":"G181","v":{"v":2.25034533624825,"d":"2.25 "}}]
[null,null,"Russian Federation",{"v":1.12949,"d":"1.129 "},{"v":58.29239,"d":"58.292 "},{"v":24.547936,"d":"24.548 "},{"$f":"D182*E182/F182","v":{"v":2.68212657801862,"d":"2.68 "}},{"$f":"VLOOKUP(C182,'11.Region'!$B$22:$E$243,4,FALSE())","v":"Europe"},{"$f":"G182","v":{"v":2.68212657801862,"d":"2.68 "}}]
[null,null,"Romania",{"v":1.12949,"d":"1.129 "},{"v":4.04725,"d":"4.047 "},{"v":1.69586564059295,"d":"1.696 "},{"$f":"D183*E183/F183","v":{"v":2.69557227475973,"d":"2.70 "}},{"$f":"VLOOKUP(C183,'11.Region'!$B$22:$E$243,4,FALSE())","v":"Europe"},{"$f":"G183","v":{"v":2.69557227475973,"d":"2.70 "}}]
[null,null,"Montenegro",{"v":1.12949,"d":"1.129 "},{"$f":"1/1.12949","v":{"v":0.885355337364651,"d":"0.885 "}},{"v":0.362693298031742,"d":"0.363 "},{"$f":"D184*E184/F184","v":{"v":2.75715047790181,"d":"2.76 "}},{"$f":"VLOOKUP(C184,'11.Region'!$B$22:$E$243,4,FALSE())","v":"Europe"},{"$f":"G184","v":{"v":2.75715047790181,"d":"2.76 "}}]
[null,null,"Moldova",{"v":1.12949,"d":"1.129 "},{"v":18.2129,"d":"18.213 "},{"v":7.43448148063916,"d":"7.434 "},{"$f":"D185*E185/F185","v":{"v":2.76701051372199,"d":"2.77 "}},{"$f":"VLOOKUP(C185,'11.Region'!$B$22:$E$243,4,FALSE())","v":"Europe"},{"$f":"G185","v":{"v":2.76701051372199,"d":"2.77 "}}]
[null,null,"Bosnia and Herzegovina",{"v":1.12949,"d":"1.129 "},{"v":1.73217,"d":"1.732 "},{"v":0.698236860098049,"d":"0.698 "},{"$f":"D186*E186/F186","v":{"v":2.8020129058,"d":"2.80 "}},{"$f":"VLOOKUP(C186,'11.Region'!$B$22:$E$243,4,FALSE())","v":"Europe"},{"$f":"G186","v":{"v":2.8020129058,"d":"2.80 "}}]
[null,null,"Bulgaria",{"v":1.12949,"d":"1.129 "},{"v":1.72845,"d":"1.728 "},{"v":0.685651212522367,"d":"0.686 "},{"$f":"D187*E187/F187","v":{"v":2.84731792906487,"d":"2.85 "}},{"$f":"VLOOKUP(C187,'11.Region'!$B$22:$E$243,4,FALSE())","v":"Europe"},{"$f":"G187","v":{"v":2.84731792906487,"d":"2.85 "}}]
[null,null,"Serbia",{"v":1.12949,"d":"1.129 "},{"v":107.40032,"d":"107.400 "},{"v":42.1325700819016,"d":"42.133 "},{"$f":"D188*E188/F188","v":{"v":2.87918793467832,"d":"2.88 "}},{"$f":"VLOOKUP(C188,'11.Region'!$B$22:$E$243,4,FALSE())","v":"Europe"},{"$f":"G188","v":{"v":2.87918793467832,"d":"2.88 "}}]
[null,null,"Albania",{"v":1.12949,"d":"1.129 "},{"v":117.69137,"d":"117.691 "},{"v":44.9606493941025,"d":"44.961 "},{"$f":"D189*E189/F189","v":{"v":2.95661266669197,"d":"2.96 "}},{"$f":"VLOOKUP(C189,'11.Region'!$B$22:$E$243,4,FALSE())","v":"Europe"},{"$f":"G189","v":{"v":2.95661266669197,"d":"2.96 "}}]
[null,null,"Macedonia, FYR",{"v":1.12949,"d":"1.129 "},{"v":54.24558,"d":"54.246 "},{"v":19.5336154553818,"d":"19.534 "},{"$f":"D190*E190/F190","v":{"v":3.1366359337907,"d":"3.14 "}},{"$f":"VLOOKUP(C190,'11.Region'!$B$22:$E$243,4,FALSE())","v":"Europe"},{"$f":"G190","v":{"v":3.1366359337907,"d":"3.14 "}}]
[null,null,"Kosovo",{"v":1.12949,"d":"1.129 "},{"v":1,"d":"1.000 "},{"v":0.321311102955936,"d":"0.321 "},{"$f":"D191*E191/F191","v":{"v":3.51525356456448,"d":"3.52 "}},{"$f":"VLOOKUP(C191,'11.Region'!$B$22:$E$243,4,FALSE())","v":"Europe"},{"$f":"G191","v":{"v":3.51525356456448,"d":"3.52 "}}]
[null,null,"Ukraine",{"v":1.12949,"d":"1.129 "},{"v":26.40741,"d":"26.407 "},{"v":8.10097955919182,"d":"8.101 "},{"$f":"D192*E192/F192","v":{"v":3.68188875221352,"d":"3.68 "}},{"$f":"VLOOKUP(C192,'11.Region'!$B$22:$E$243,4,FALSE())","v":"Europe"},{"$f":"G192","v":{"v":3.68188875221352,"d":"3.68 "}}]
[null,null,"Belarus",{"v":1.12949,"d":"1.129 "},{"v":1.977391353,"d":"1.977 "},{"v":0.587035544710029,"d":"0.587 "},{"$f":"D193*E193/F193","v":{"v":3.80461418295071,"d":"3.80 "}},{"$f":"VLOOKUP(C193,'11.Region'!$B$22:$E$243,4,FALSE())","v":"Europe"},{"$f":"G193","v":{"v":3.80461418295071,"d":"3.80 "}}]
[null,null,"Andorra",{"v":1.12949,"d":"1.129 "},{"$f":"1/1.12949","v":{"v":0.885355337364651,"d":"0.885 "}},null,{"$f":"D194*E194/F194","v":{"$error":"#DIV/0!"}},{"$f":"VLOOKUP(C194,'11.Region'!$B$22:$E$243,4,FALSE())","v":"Europe"},{"$f":"$K$153","v":{"v":1.93286164519776,"d":"1.93 "}},"est"]
[null,null,"Faroe Islands",{"v":1.12949,"d":"1.129 "},null,null,{"$f":"D195*E195/F195","v":{"$error":"#DIV/0!"}},{"$f":"VLOOKUP(C195,'11.Region'!$B$22:$E$243,4,FALSE())","v":"Europe"},{"$f":"$K$153","v":{"v":1.93286164519776,"d":"1.93 "}},"est"]
[null,null,"Gibraltar",{"v":1.12949,"d":"1.129 "},null,null,{"$f":"D196*E196/F196","v":{"$error":"#DIV/0!"}},{"$f":"VLOOKUP(C196,'11.Region'!$B$22:$E$243,4,FALSE())","v":"Europe"},{"$f":"$K$153","v":{"v":1.93286164519776,"d":"1.93 "}},"est"]
[null,null,"Isle of Man",{"v":1.12949,"d":"1.129 "},null,null,{"$f":"D197*E197/F197","v":{"$error":"#DIV/0!"}},{"$f":"VLOOKUP(C197,'11.Region'!$B$22:$E$243,4,FALSE())","v":"Europe"},{"$f":"$K$153","v":{"v":1.93286164519776,"d":"1.93 "}},"est"]
[null,null,"Liechtenstein",{"v":1.12949,"d":"1.129 "},null,null,{"$f":"D198*E198/F198","v":{"$error":"#DIV/0!"}},{"$f":"VLOOKUP(C198,'11.Region'!$B$22:$E$243,4,FALSE())","v":"Europe"},{"$f":"$K$153","v":{"v":1.93286164519776,"d":"1.93 "}},"est"]
[null,null,"Monaco",{"v":1.12949,"d":"1.129 "},{"$f":"1/1.12949","v":{"v":0.885355337364651,"d":"0.885 "}},null,{"$f":"D199*E199/F199","v":{"$error":"#DIV/0!"}},{"$f":"VLOOKUP(C199,'11.Region'!$B$22:$E$243,4,FALSE())","v":"Europe"},{"$f":"$K$153","v":{"v":1.93286164519776,"d":"1.93 "}},"est"]
[null,null,"Samoa",{"v":1.12949,"d":"1.129 "},{"v":1,"d":"1.000 "},{"v":1.6425069820888,"d":"1.643 "},{"$f":"D200*E200/F200","v":{"v":0.687662221419364,"d":"0.69 "}},{"$f":"VLOOKUP(C200,'11.Region'!$B$22:$E$243,4,FALSE())","v":"Oceania"},{"$f":"G200","v":{"v":0.687662221419364,"d":"0.69 "}},null,{"$f":"AVERAGE(G200:G213)","v":{"v":1.35633083709363,"d":"1.36 "}},"Oceania"]
[null,null,"Australia",{"v":1.12949,"d":"1.129 "},{"v":1.30488,"d":"1.305 "},{"v":1.516225,"d":"1.516 "},{"$f":"D201*E201/F201","v":{"v":0.972051582845554,"d":"0.97 "}},{"$f":"VLOOKUP(C201,'11.Region'!$B$22:$E$243,4,FALSE())","v":"Oceania"},{"$f":"G201","v":{"v":0.972051582845554,"d":"0.97 "}}]
[null,null,"New Zealand",{"v":1.12949,"d":"1.129 "},{"v":1.40717,"d":"1.407 "},{"v":1.477015,"d":"1.477 "},{"$f":"D202*E202/F202","v":{"v":1.07607874212516,"d":"1.08 "}},{"$f":"VLOOKUP(C202,'11.Region'!$B$22:$E$243,4,FALSE())","v":"Oceania"},{"$f":"G202","v":{"v":1.07607874212516,"d":"1.08 "}}]
[null,null,"Vanuatu",{"v":1.12949,"d":"1.129 "},{"v":106.12934,"d":"106.129 "},{"v":103.3875398947,"d":"103.388 "},{"$f":"D203*E203/F203","v":{"v":1.15944366563601,"d":"1.16 "}},{"$f":"VLOOKUP(C203,'11.Region'!$B$22:$E$243,4,FALSE())","v":"Oceania"},{"$f":"G203","v":{"v":1.15944366563601,"d":"1.16 "}}]
[null,null,"Palau",{"v":1.12949,"d":"1.129 "},{"v":1,"d":"1.000 "},{"v":0.923036082275079,"d":"0.923 "},{"$f":"D204*E204/F204","v":{"v":1.22366830689442,"d":"1.22 "}},{"$f":"VLOOKUP(C204,'11.Region'!$B$22:$E$243,4,FALSE())","v":"Oceania"},{"$f":"G204","v":{"v":1.22366830689442,"d":"1.22 "}}]
[null,null,"Solomon Islands",{"v":1.12949,"d":"1.129 "},{"v":7.64672,"d":"7.647 "},{"v":6.9439924666351,"d":"6.944 "},{"$f":"D205*E205/F205","v":{"v":1.24379365535015,"d":"1.24 "}},{"$f":"VLOOKUP(C205,'11.Region'!$B$22:$E$243,4,FALSE())","v":"Oceania"},{"$f":"G205","v":{"v":1.24379365535015,"d":"1.24 "}}]
[null,null,"Tuvalu",{"v":1.12949,"d":"1.129 "},{"v":1.30488,"d":"1.305 "},{"v":1.17165386377771,"d":"1.172 "},{"$f":"D206*E206/F206","v":{"v":1.25792177772362,"d":"1.26 "}},{"$f":"VLOOKUP(C206,'11.Region'!$B$22:$E$243,4,FALSE())","v":"Oceania"},{"$f":"G206","v":{"v":1.25792177772362,"d":"1.26 "}}]
[null,null,"Marshall Islands",{"v":1.12949,"d":"1.129 "},{"v":1,"d":"1.000 "},{"v":0.895139466288157,"d":"0.895 "},{"$f":"D207*E207/F207","v":{"v":1.26180337538196,"d":"1.26 "}},{"$f":"VLOOKUP(C207,'11.Region'!$B$22:$E$243,4,FALSE())","v":"Oceania"},{"$f":"G207","v":{"v":1.26180337538196,"d":"1.26 "}}]
[null,null,"Micronesia, Fed. Sts.",{"v":1.12949,"d":"1.129 "},{"v":1,"d":"1.000 "},{"v":0.879973781757838,"d":"0.880 "},{"$f":"D208*E208/F208","v":{"v":1.28354960501633,"d":"1.28 "}},{"$f":"VLOOKUP(C208,'11.Region'!$B$22:$E$243,4,FALSE())","v":"Oceania"},{"$f":"G208","v":{"v":1.28354960501633,"d":"1.28 "}}]
[null,null,"Kiribati",{"v":1.12949,"d":"1.129 "},{"v":1.30488,"d":"1.305 "},{"v":1.01094754194661,"d":"1.011 "},{"$f":"D209*E209/F209","v":{"v":1.45788861443993,"d":"1.46 "}},{"$f":"VLOOKUP(C209,'11.Region'!$B$22:$E$243,4,FALSE())","v":"Oceania"},{"$f":"G209","v":{"v":1.45788861443993,"d":"1.46 "}}]
[null,null,"Tonga",{"v":1.12949,"d":"1.129 "},{"v":2.26634,"d":"2.266 "},{"v":1.46372744667467,"d":"1.464 "},{"$f":"D210*E210/F210","v":{"v":1.74882856259574,"d":"1.75 "}},{"$f":"VLOOKUP(C210,'11.Region'!$B$22:$E$243,4,FALSE())","v":"Oceania"},{"$f":"G210","v":{"v":1.74882856259574,"d":"1.75 "}}]
[null,null,"Papua New Guinea",{"v":1.12949,"d":"1.129 "},{"v":3.12514,"d":"3.125 "},{"v":1.94174409917977,"d":"1.942 "},{"$f":"D211*E211/F211","v":{"v":1.81785765698532,"d":"1.82 "}},{"$f":"VLOOKUP(C211,'11.Region'!$B$22:$E$243,4,FALSE())","v":"Oceania"},{"$f":"G211","v":{"v":1.81785765698532,"d":"1.82 "}}]
[null,null,"Nauru",{"v":1.12949,"d":"1.129 "},{"v":1.30488,"d":"1.305 "},{"v":0.781427200668124,"d":"0.781 "},{"$f":"D212*E212/F212","v":{"v":1.88609880733593,"d":"1.89 "}},{"$f":"VLOOKUP(C212,'11.Region'!$B$22:$E$243,4,FALSE())","v":"Oceania"},{"$f":"G212","v":{"v":1.88609880733593,"d":"1.89 "}}]
[null,null,"Fiji",{"v":1.12949,"d":"1.129 "},{"v":2.04679,"d":"2.047 "},{"v":1.20912489433657,"d":"1.209 "},{"$f":"D213*E213/F213","v":{"v":1.91198514556138,"d":"1.91 "}},{"$f":"VLOOKUP(C213,'11.Region'!$B$22:$E$243,4,FALSE())","v":"Oceania"},{"$f":"G213","v":{"v":1.91198514556138,"d":"1.91 "}}]
[null,null,"American Samoa",{"v":1.12949,"d":"1.129 "},{"v":1,"d":"1.000 "},null,{"$f":"D214*E214/F214","v":{"$error":"#DIV/0!"}},{"$f":"VLOOKUP(C214,'11.Region'!$B$22:$E$243,4,FALSE())","v":"Oceania"},{"$f":"$K$200","v":{"v":1.35633083709363,"d":"1.36 "}},"est"]
[null,null,"Guam",{"v":1.12949,"d":"1.129 "},null,null,{"$f":"D215*E215/F215","v":{"$error":"#DIV/0!"}},{"$f":"VLOOKUP(C215,'11.Region'!$B$22:$E$243,4,FALSE())","v":"Oceania"},{"$f":"$K$200","v":{"v":1.35633083709363,"d":"1.36 "}},"est"]
[null,null,"Northern Mariana Islands",{"v":1.12949,"d":"1.129 "},null,null,{"$f":"D216*E216/F216","v":{"$error":"#DIV/0!"}},{"$f":"VLOOKUP(C216,'11.Region'!$B$22:$E$243,4,FALSE())","v":"Oceania"},{"$f":"$K$200","v":{"v":1.35633083709363,"d":"1.36 "}},"est"]
[null,null,"New Caledonia",{"v":1.12949,"d":"1.129 "},null,null,{"$f":"D217*E217/F217","v":{"$error":"#DIV/0!"}},{"$f":"VLOOKUP(C217,'11.Region'!$B$22:$E$243,4,FALSE())","v":"Oceania"},{"$f":"$K$200","v":{"v":1.35633083709363,"d":"1.36 "}},"est"]
[null,null,"French Polynesia",{"v":1.12949,"d":"1.129 "},null,null,{"$f":"D218*E218/F218","v":{"$error":"#DIV/0!"}},{"$f":"VLOOKUP(C218,'11.Region'!$B$22:$E$243,4,FALSE())","v":"Oceania"},{"$f":"$K$200","v":{"v":1.35633083709363,"d":"1.36 "}},"est"]
[null,null,"Arab World",{"v":1.12949,"d":"1.129 "},null,null,{"$f":"D219*E219/F219","v":{"$error":"#DIV/0!"}},{"$f":"VLOOKUP(C219,'11.Region'!$B$22:$E$243,4,FALSE())","v":{"$error":"#N/A"}}]
[null,null,"Central Europe and the Baltics",{"v":1.12949,"d":"1.129 "},null,null,{"$f":"D220*E220/F220","v":{"$error":"#DIV/0!"}},{"$f":"VLOOKUP(C220,'11.Region'!$B$22:$E$243,4,FALSE())","v":{"$error":"#N/A"}}]
[null,null,"Channel Islands",{"v":1.12949,"d":"1.129 "},null,null,{"$f":"D221*E221/F221","v":{"$error":"#DIV/0!"}},{"$f":"VLOOKUP(C221,'11.Region'!$B$22:$E$243,4,FALSE())","v":{"$error":"#N/A"}}]
[null,null,"Caribbean small states",{"v":1.12949,"d":"1.129 "},null,null,{"$f":"D222*E222/F222","v":{"$error":"#DIV/0!"}},{"$f":"VLOOKUP(C222,'11.Region'!$B$22:$E$243,4,FALSE())","v":{"$error":"#N/A"}}]
[null,null,"East Asia & Pacific (excluding high income)",{"v":1.12949,"d":"1.129 "},null,null,{"$f":"D223*E223/F223","v":{"$error":"#DIV/0!"}},{"$f":"VLOOKUP(C223,'11.Region'!$B$22:$E$243,4,FALSE())","v":{"$error":"#N/A"}}]
[null,null,"Early-demographic dividend",{"v":1.12949,"d":"1.129 "},null,null,{"$f":"D224*E224/F224","v":{"$error":"#DIV/0!"}},{"$f":"VLOOKUP(C224,'11.Region'!$B$22:$E$243,4,FALSE())","v":{"$error":"#N/A"}}]
[null,null,"East Asia & Pacific",{"v":1.12949,"d":"1.129 "},null,null,{"$f":"D225*E225/F225","v":{"$error":"#DIV/0!"}},{"$f":"VLOOKUP(C225,'11.Region'!$B$22:$E$243,4,FALSE())","v":{"$error":"#N/A"}}]
[null,null,"Europe & Central Asia (excluding high income)",{"v":1.12949,"d":"1.129 "},null,null,{"$f":"D226*E226/F226","v":{"$error":"#DIV/0!"}},{"$f":"VLOOKUP(C226,'11.Region'!$B$22:$E$243,4,FALSE())","v":{"$error":"#N/A"}}]
[null,null,"Europe & Central Asia",{"v":1.12949,"d":"1.129 "},null,null,{"$f":"D227*E227/F227","v":{"$error":"#DIV/0!"}},{"$f":"VLOOKUP(C227,'11.Region'!$B$22:$E$243,4,FALSE())","v":{"$error":"#N/A"}}]
[null,null,"Euro area",{"v":1.12949,"d":"1.129 "},null,null,{"$f":"D228*E228/F228","v":{"$error":"#DIV/0!"}},{"$f":"VLOOKUP(C228,'11.Region'!$B$22:$E$243,4,FALSE())","v":{"$error":"#N/A"}}]
[null,null,"European Union",{"v":1.12949,"d":"1.129 "},null,null,{"$f":"D229*E229/F229","v":{"$error":"#DIV/0!"}},{"$f":"VLOOKUP(C229,'11.Region'!$B$22:$E$243,4,FALSE())","v":{"$error":"#N/A"}}]
[null,null,"Fragile and conflict affected situations",{"v":1.12949,"d":"1.129 "},null,null,{"$f":"D230*E230/F230","v":{"$error":"#DIV/0!"}},{"$f":"VLOOKUP(C230,'11.Region'!$B$22:$E$243,4,FALSE())","v":{"$error":"#N/A"}}]
[null,null,"High income",{"v":1.12949,"d":"1.129 "},null,null,{"$f":"D231*E231/F231","v":{"$error":"#DIV/0!"}},{"$f":"VLOOKUP(C231,'11.Region'!$B$22:$E$243,4,FALSE())","v":{"$error":"#N/A"}}]
[null,null,"Heavily indebted poor countries (HIPC)",{"v":1.12949,"d":"1.129 "},null,null,{"$f":"D232*E232/F232","v":{"$error":"#DIV/0!"}},{"$f":"VLOOKUP(C232,'11.Region'!$B$22:$E$243,4,FALSE())","v":{"$error":"#N/A"}}]
[null,null,"IBRD only",{"v":1.12949,"d":"1.129 "},null,null,{"$f":"D233*E233/F233","v":{"$error":"#DIV/0!"}},{"$f":"VLOOKUP(C233,'11.Region'!$B$22:$E$243,4,FALSE())","v":{"$error":"#N/A"}}]
[null,null,"IDA & IBRD total",{"v":1.12949,"d":"1.129 "},null,null,{"$f":"D234*E234/F234","v":{"$error":"#DIV/0!"}},{"$f":"VLOOKUP(C234,'11.Region'!$B$22:$E$243,4,FALSE())","v":{"$error":"#N/A"}}]
[null,null,"IDA total",{"v":1.12949,"d":"1.129 "},null,null,{"$f":"D235*E235/F235","v":{"$error":"#DIV/0!"}},{"$f":"VLOOKUP(C235,'11.Region'!$B$22:$E$243,4,FALSE())","v":{"$error":"#N/A"}}]
[null,null,"IDA blend",{"v":1.12949,"d":"1.129 "},null,null,{"$f":"D236*E236/F236","v":{"$error":"#DIV/0!"}},{"$f":"VLOOKUP(C236,'11.Region'!$B$22:$E$243,4,FALSE())","v":{"$error":"#N/A"}}]
[null,null,"IDA only",{"v":1.12949,"d":"1.129 "},null,null,{"$f":"D237*E237/F237","v":{"$error":"#DIV/0!"}},{"$f":"VLOOKUP(C237,'11.Region'!$B$22:$E$243,4,FALSE())","v":{"$error":"#N/A"}}]
[null,null,"Not classified",{"v":1.12949,"d":"1.129 "},null,null,{"$f":"D238*E238/F238","v":{"$error":"#DIV/0!"}},{"$f":"VLOOKUP(C238,'11.Region'!$B$22:$E$243,4,FALSE())","v":{"$error":"#N/A"}}]
[null,null,"Latin America & Caribbean (excluding high income)",{"v":1.12949,"d":"1.129 "},null,null,{"$f":"D239*E239/F239","v":{"$error":"#DIV/0!"}},{"$f":"VLOOKUP(C239,'11.Region'!$B$22:$E$243,4,FALSE())","v":{"$error":"#N/A"}}]
[null,null,"Latin America & Caribbean",{"v":1.12949,"d":"1.129 "},null,null,{"$f":"D240*E240/F240","v":{"$error":"#DIV/0!"}},{"$f":"VLOOKUP(C240,'11.Region'!$B$22:$E$243,4,FALSE())","v":{"$error":"#N/A"}}]
[null,null,"Least developed countries: UN classification",{"v":1.12949,"d":"1.129 "},null,null,{"$f":"D241*E241/F241","v":{"$error":"#DIV/0!"}},{"$f":"VLOOKUP(C241,'11.Region'!$B$22:$E$243,4,FALSE())","v":{"$error":"#N/A"}}]
[null,null,"Low income",{"v":1.12949,"d":"1.129 "},null,null,{"$f":"D242*E242/F242","v":{"$error":"#DIV/0!"}},{"$f":"VLOOKUP(C242,'11.Region'!$B$22:$E$243,4,FALSE())","v":{"$error":"#N/A"}}]
[null,null,"Lower middle income",{"v":1.12949,"d":"1.129 "},null,null,{"$f":"D243*E243/F243","v":{"$error":"#DIV/0!"}},{"$f":"VLOOKUP(C243,'11.Region'!$B$22:$E$243,4,FALSE())","v":{"$error":"#N/A"}}]
[null,null,"Low & middle income",{"v":1.12949,"d":"1.129 "},null,null,{"$f":"D244*E244/F244","v":{"$error":"#DIV/0!"}},{"$f":"VLOOKUP(C244,'11.Region'!$B$22:$E$243,4,FALSE())","v":{"$error":"#N/A"}}]
[null,null,"Late-demographic dividend",{"v":1.12949,"d":"1.129 "},null,null,{"$f":"D245*E245/F245","v":{"$error":"#DIV/0!"}},{"$f":"VLOOKUP(C245,'11.Region'!$B$22:$E$243,4,FALSE())","v":{"$error":"#N/A"}}]
[null,null,"Middle East & North Africa",{"v":1.12949,"d":"1.129 "},null,null,{"$f":"D246*E246/F246","v":{"$error":"#DIV/0!"}},{"$f":"VLOOKUP(C246,'11.Region'!$B$22:$E$243,4,FALSE())","v":{"$error":"#N/A"}}]
[null,null,"Middle income",{"v":1.12949,"d":"1.129 "},null,null,{"$f":"D247*E247/F247","v":{"$error":"#DIV/0!"}},{"$f":"VLOOKUP(C247,'11.Region'!$B$22:$E$243,4,FALSE())","v":{"$error":"#N/A"}}]
[null,null,"Middle East & North Africa (excluding high income)",{"v":1.12949,"d":"1.129 "},null,null,{"$f":"D248*E248/F248","v":{"$error":"#DIV/0!"}},{"$f":"VLOOKUP(C248,'11.Region'!$B$22:$E$243,4,FALSE())","v":{"$error":"#N/A"}}]
[null,null,"North America",{"v":1.12949,"d":"1.129 "},null,null,{"$f":"D249*E249/F249","v":{"$error":"#DIV/0!"}},{"$f":"VLOOKUP(C249,'11.Region'!$B$22:$E$243,4,FALSE())","v":{"$error":"#N/A"}}]
[null,null,"OECD members",{"v":1.12949,"d":"1.129 "},null,null,{"$f":"D250*E250/F250","v":{"$error":"#DIV/0!"}},{"$f":"VLOOKUP(C250,'11.Region'!$B$22:$E$243,4,FALSE())","v":{"$error":"#N/A"}}]
[null,null,"Other small states",{"v":1.12949,"d":"1.129 "},null,null,{"$f":"D251*E251/F251","v":{"$error":"#DIV/0!"}},{"$f":"VLOOKUP(C251,'11.Region'!$B$22:$E$243,4,FALSE())","v":{"$error":"#N/A"}}]
[null,null,"Pre-demographic dividend",{"v":1.12949,"d":"1.129 "},null,null,{"$f":"D252*E252/F252","v":{"$error":"#DIV/0!"}},{"$f":"VLOOKUP(C252,'11.Region'!$B$22:$E$243,4,FALSE())","v":{"$error":"#N/A"}}]
[null,null,"Pacific island small states",{"v":1.12949,"d":"1.129 "},null,null,{"$f":"D253*E253/F253","v":{"$error":"#DIV/0!"}},{"$f":"VLOOKUP(C253,'11.Region'!$B$22:$E$243,4,FALSE())","v":{"$error":"#N/A"}}]
[null,null,"Post-demographic dividend",{"v":1.12949,"d":"1.129 "},null,null,{"$f":"D254*E254/F254","v":{"$error":"#DIV/0!"}},{"$f":"VLOOKUP(C254,'11.Region'!$B$22:$E$243,4,FALSE())","v":{"$error":"#N/A"}}]
[null,null,"South Asia",{"v":1.12949,"d":"1.129 "},null,null,{"$f":"D255*E255/F255","v":{"$error":"#DIV/0!"}},{"$f":"VLOOKUP(C255,'11.Region'!$B$22:$E$243,4,FALSE())","v":{"$error":"#N/A"}}]
[null,null,"Sub-Saharan Africa (excluding high income)",{"v":1.12949,"d":"1.129 "},null,null,{"$f":"D256*E256/F256","v":{"$error":"#DIV/0!"}},{"$f":"VLOOKUP(C256,'11.Region'!$B$22:$E$243,4,FALSE())","v":{"$error":"#N/A"}}]
[null,null,"Sub-Saharan Africa",{"v":1.12949,"d":"1.129 "},null,null,{"$f":"D257*E257/F257","v":{"$error":"#DIV/0!"}},{"$f":"VLOOKUP(C257,'11.Region'!$B$22:$E$243,4,FALSE())","v":{"$error":"#N/A"}}]
[null,null,"Small states",{"v":1.12949,"d":"1.129 "},null,null,{"$f":"D258*E258/F258","v":{"$error":"#DIV/0!"}},{"$f":"VLOOKUP(C258,'11.Region'!$B$22:$E$243,4,FALSE())","v":{"$error":"#N/A"}}]
[null,null,"East Asia & Pacific (IDA & IBRD countries)",{"v":1.12949,"d":"1.129 "},null,null,{"$f":"D259*E259/F259","v":{"$error":"#DIV/0!"}},{"$f":"VLOOKUP(C259,'11.Region'!$B$22:$E$243,4,FALSE())","v":{"$error":"#N/A"}}]
[null,null,"Europe & Central Asia (IDA & IBRD countries)",{"v":1.12949,"d":"1.129 "},null,null,{"$f":"D260*E260/F260","v":{"$error":"#DIV/0!"}},{"$f":"VLOOKUP(C260,'11.Region'!$B$22:$E$243,4,FALSE())","v":{"$error":"#N/A"}}]
[null,null,"Latin America & the Caribbean (IDA & IBRD countries)",{"v":1.12949,"d":"1.129 "},null,null,{"$f":"D261*E261/F261","v":{"$error":"#DIV/0!"}},{"$f":"VLOOKUP(C261,'11.Region'!$B$22:$E$243,4,FALSE())","v":{"$error":"#N/A"}}]
[null,null,"Middle East & North Africa (IDA & IBRD countries)",{"v":1.12949,"d":"1.129 "},null,null,{"$f":"D262*E262/F262","v":{"$error":"#DIV/0!"}},{"$f":"VLOOKUP(C262,'11.Region'!$B$22:$E$243,4,FALSE())","v":{"$error":"#N/A"}}]
[null,null,"South Asia (IDA & IBRD)",{"v":1.12949,"d":"1.129 "},null,null,{"$f":"D263*E263/F263","v":{"$error":"#DIV/0!"}},{"$f":"VLOOKUP(C263,'11.Region'!$B$22:$E$243,4,FALSE())","v":{"$error":"#N/A"}}]
[null,null,"Sub-Saharan Africa (IDA & IBRD countries)",{"v":1.12949,"d":"1.129 "},null,null,{"$f":"D264*E264/F264","v":{"$error":"#DIV/0!"}},{"$f":"VLOOKUP(C264,'11.Region'!$B$22:$E$243,4,FALSE())","v":{"$error":"#N/A"}}]
[null,null,"Upper middle income",{"v":1.12949,"d":"1.129 "},null,null,{"$f":"D265*E265/F265","v":{"$error":"#DIV/0!"}},{"$f":"VLOOKUP(C265,'11.Region'!$B$22:$E$243,4,FALSE())","v":{"$error":"#N/A"}}]
[null,null,"World",{"v":1.12949,"d":"1.129 "},null,null,{"$f":"D266*E266/F266","v":{"$error":"#DIV/0!"}},{"$f":"VLOOKUP(C266,'11.Region'!$B$22:$E$243,4,FALSE())","v":{"$error":"#N/A"}}]

{"sheet":"12.lan","index":13,"n_rows":561,"n_cols":13,"rows_kept":561,"hidden":true}
[null,null,{"$f":"VLOOKUP('0. Intro'!B1,'12.lan'!B2:C12,2,FALSE())","v":3},{"$f":"HLOOKUP($C$1,$E$1:$X$4910,ROW(D1))","v":3},1,2,3,4,5,6,7]
[3,"Select your language",{"$f":"A2","v":3},{"$f":"HLOOKUP($C$1,$E$1:$X$4910,ROW(D2))","v":"English"},"Deutsch","Italiano","English","Español","Francais","Portugues","Griechisch"]
[1,"Deutsch",{"$f":"A3","v":1},{"$f":"HLOOKUP($C$1,$E$1:$X$4910,ROW(D3))","v":0}]
[2,"Italiano",{"$f":"A4","v":2},{"$f":"HLOOKUP($C$1,$E$1:$X$4910,ROW(D4))","v":"BALANCE SHEET CALCULATOR"},"GEMEINWOHL-RECHNER","Calcolatore del Bene Comune","BALANCE SHEET CALCULATOR","CALCULADORA DEL BIEN COMÚN",{"$f":"\"[fr]\"&E4","v":"[fr]GEMEINWOHL-RECHNER"},{"$f":"\"[pt]\"&E4","v":"[pt]GEMEINWOHL-RECHNER"},{"$f":"\"[gr]\"&E4","v":"[gr]GEMEINWOHL-RECHNER"}]
[3,"English",{"$f":"A5","v":3},{"$f":"HLOOKUP($C$1,$E$1:$X$4910,ROW(D5))","v":"© ECG"},"© GWÖ","© Economia del Bene Comune","© ECG","© Economía del Bien Común",{"$f":"\"[fr]\"&E5","v":"[fr]© GWÖ"},{"$f":"\"[pt]\"&E5","v":"[pt]© GWÖ"},{"$f":"\"[gr]\"&E5","v":"[gr]© GWÖ"}]
[4,"Español",{"$f":"A6","v":4},{"$f":"HLOOKUP($C$1,$E$1:$X$4910,ROW(D6))","v":"Version"},"Version","Versione","Version","Versión",{"$f":"\"[fr]\"&E6","v":"[fr]Version"},"Versão",{"$f":"\"[gr]\"&E6","v":"[gr]Version"}]
[5,"Francais",{"$f":"A7","v":5},{"$f":"HLOOKUP($C$1,$E$1:$X$4910,ROW(D7))","v":"WELCOME!"},"HERZLICH WILLKOMMEN!","Benvenuto!","WELCOME!","¡Bienvenid@!",{"$f":"\"[fr]\"&E7","v":"[fr]HERZLICH WILLKOMMEN!"},{"$f":"\"[pt]\"&E7","v":"[pt]HERZLICH WILLKOMMEN!"},{"$f":"\"[gr]\"&E7","v":"[gr]HERZLICH WILLKOMMEN!"}]
[6,"Portugues",{"$f":"A8","v":6},{"$f":"HLOOKUP($C$1,$E$1:$X$4910,ROW(D8))","v":"This tool is for calculating the overall Common Good Points for your company or organisation. It complements the Common Good Report and has to be used together with it. Have fun with your calculation!"},"Dieses Tool dient zur Berechnung der Gemeinwohl-Punkte Ihres Unternehmens. Es ist eine Ergänzung zum Gemeinwohlbericht und muss gemeinsam mit diesem genutzt werden.  Wir wünschen gutes Gelingen!","Può utilizzare questo strumento per calcolare i punti del bene comune della sua impresa. Serve quale completamento alla relazione del bene comune e deve essere utilizzato assieme a questo.\nLe auguriamo buon divertimento in questa attività di calcolo!","This tool is for calculating the overall Common Good Points for your company or organisation. It complements the Common Good Report and has to be used together with it. Have fun with your calculation!","Esta herramienta sirve para calcular la puntuación de su empresa de acuerdo al balance del Bien Común. Esta hoja de cálculo es complementaria al informe del Bien Común y debe utilizarse por tanto conjuntamente. ¡Buena suerte!",{"$f":"\"[fr]\"&E8","v":"[fr]Dieses Tool dient zur Berechnung der Gemeinwohl-Punkte Ihres Unternehmens. Es ist eine Ergänzung zum Gemeinwohlbericht und muss gemeinsam mit diesem genutzt werden.  Wir wünschen gutes Gelingen!"},{"$f":"\"[pt]\"&E8","v":"[pt]Dieses Tool dient zur Berechnung der Gemeinwohl-Punkte Ihres Unternehmens. Es ist eine Ergänzung zum Gemeinwohlbericht und muss gemeinsam mit diesem genutzt werden.  Wir wünschen gutes Gelingen!"},{"$f":"\"[gr]\"&E8","v":"[gr]Dieses Tool dient zur Berechnung der Gemeinwohl-Punkte Ihres Unternehmens. Es ist eine Ergänzung zum Gemeinwohlbericht und muss gemeinsam mit diesem genutzt werden.  Wir wünschen gutes Gelingen!"}]
[7,"Griechisch",{"$f":"A9","v":7},{"$f":"HLOOKUP($C$1,$E$1:$X$4910,ROW(D9))","v":"HOW TO USE THE BALANCE SHEET CALCULATOR:"},"WIE SIE DEN BILANZ-RECHNER RICHTIG VERWENDEN:","Come utilizzare correttamente il calcolatore del bilancio:","HOW TO USE THE BALANCE SHEET CALCULATOR:","Cómo utilizar la calculadora del Bien Común correctamente",{"$f":"\"[fr]\"&E9","v":"[fr]WIE SIE DEN BILANZ-RECHNER RICHTIG VERWENDEN:"},{"$f":"\"[pt]\"&E9","v":"[pt]WIE SIE DEN BILANZ-RECHNER RICHTIG VERWENDEN:"},{"$f":"\"[gr]\"&E9","v":"[gr]WIE SIE DEN BILANZ-RECHNER RICHTIG VERWENDEN:"}]
[8,null,{"$f":"A10","v":8},{"$f":"HLOOKUP($C$1,$E$1:$X$4910,ROW(D10))","v":"1. General"},"1. Allgemeines","1. Generale","1. General","1. General",{"$f":"\"[fr]\"&E10","v":"[fr]1. Allgemeines"},{"$f":"\"[pt]\"&E10","v":"[pt]1. Allgemeines"},{"$f":"\"[gr]\"&E10","v":"[gr]1. Allgemeines"}]
[9,null,{"$f":"A11","v":9},{"$f":"HLOOKUP($C$1,$E$1:$X$4910,ROW(D11))","v":"You can enter general information about your company or organisation in this section."},"Hier können Sie allgemeinen Angaben zu Ihrem Unternehmen machen.","Qui può indicare tutte le informazioni e dati della sua impresa","You can enter general information about your company or organisation in this section.","En esta hoja puedes introducir información general sobre tu organización o empresa",{"$f":"\"[fr]\"&E11","v":"[fr]Hier können Sie allgemeinen Angaben zu Ihrem Unternehmen machen."},{"$f":"\"[pt]\"&E11","v":"[pt]Hier können Sie allgemeinen Angaben zu Ihrem Unternehmen machen."},{"$f":"\"[gr]\"&E11","v":"[gr]Hier können Sie allgemeinen Angaben zu Ihrem Unternehmen machen."}]
[10,null,{"$f":"A12","v":10},{"$f":"HLOOKUP($C$1,$E$1:$X$4910,ROW(D12))","v":"All fields in this section must be completed as they are essential for the weighting of each theme."},"Hier müssen alle geforderten Kenngrößen eingetragen werden, da diese für die Gewichtung der Themen essentiell sind. ","Qui devono essere inseriti tutti i parametri richiesti, poiché questi sono essenziali per la ponderazione degli argomenti.","All fields in this section must be completed as they are essential for the weighting of each theme.","En esta hoja debes introducir todos los datos requeridos, pues el cálculo de la ponderación depende de ellos",{"$f":"\"[fr]\"&E12","v":"[fr]Hier müssen alle geforderten Kenngrößen eingetragen werden, da diese für die Gewichtung der Themen essentiell sind."},{"$f":"\"[pt]\"&E12","v":"[pt]Hier müssen alle geforderten Kenngrößen eingetragen werden, da diese für die Gewichtung der Themen essentiell sind."},{"$f":"\"[gr]\"&E12","v":"[gr]Hier müssen alle geforderten Kenngrößen eingetragen werden, da diese für die Gewichtung der Themen essentiell sind."}]
[11,null,null,{"$f":"HLOOKUP($C$1,$E$1:$X$4910,ROW(D13))","v":"For each theme (A1, B1, ...) a certain maximum number of Common Good Points can be achieved. To evaluate how many points your company scores, follow these steps:"},"Für jedes Thema (A1, B1, ...) kann eine bestimmte Anzahl an Gemeinwohl-Punkten erreicht werden. Um zu ermitteln, wie viele davon Ihr Unternehmen erhält, gehen Sie wie folgt vor:","Per ogni tema (A1, B1, ...) può essere raggiunto un determinate valore di punteggio del bene comune. Per ricavare, che punteggio ottiene la Sua impresa proceda nel modo seguente:","For each theme (A1, B1, ...) a certain maximum number of Common Good Points can be achieved. To evaluate how many points your company scores, follow these steps:","Para cada tema (A1, B1, …) puede obtenerse una puntuación determinada. Para calcular cuál obtiene su empresa, siga los pasos siguientes:",{"$f":"\"[fr]\"&E13","v":"[fr]Für jedes Thema (A1, B1, ...) kann eine bestimmte Anzahl an Gemeinwohl-Punkten erreicht werden. Um zu ermitteln, wie viele davon Ihr Unternehmen erhält, gehen Sie wie folgt vor:"},{"$f":"\"[pt]\"&E13","v":"[pt]Für jedes Thema (A1, B1, ...) kann eine bestimmte Anzahl an Gemeinwohl-Punkten erreicht werden. Um zu ermitteln, wie viele davon Ihr Unternehmen erhält, gehen Sie wie folgt vor:"},{"$f":"\"[gr]\"&E13","v":"[gr]Für jedes Thema (A1, B1, ...) kann eine bestimmte Anzahl an Gemeinwohl-Punkten erreicht werden. Um zu ermitteln, wie viele davon Ihr Unternehmen erhält, gehen Sie wie folgt vor:"}]
[12,null,null,{"$f":"HLOOKUP($C$1,$E$1:$X$4910,ROW(D14))","v":"Describe the current status and potential for improvement for the various aspects under key headings. Use the workbook as a reference. (This is optional and not absolutely necessary for the calculation.)"},"Beschreiben Sie auf Basis des Arbeitsbuchs in wenigen Stichworten Ist-Zustand und Verbesserungspotenzial für die verschiedenen Aspekte (optional, ist für die Berechnung nicht unbedingt notwendig).","Descrivi sulla base del libro di esercizi in poche parole chiave lo stato attuale e il potenziale di miglioramento per i diversi aspetti (facoltativo, non è assolutamente necessario per il calcolo).","Describe the current status and potential for improvement for the various aspects under key headings. Use the workbook as a reference. (This is optional and not absolutely necessary for the calculation.)","Describa en pocas palabras, de acuerdo al manual del Balance del Bien Común, cuál es el estado actual y el potencial de mejora para cada uno de los aspectos (opcional, no es necesario para el cálculo de la puntuación).",{"$f":"\"[fr]\"&E14","v":"[fr]Beschreiben Sie auf Basis des Arbeitsbuchs in wenigen Stichworten Ist-Zustand und Verbesserungspotenzial für die verschiedenen Aspekte (optional, ist für die Berechnung nicht unbedingt notwendig)."},{"$f":"\"[pt]\"&E14","v":"[pt]Beschreiben Sie auf Basis des Arbeitsbuchs in wenigen Stichworten Ist-Zustand und Verbesserungspotenzial für die verschiedenen Aspekte (optional, ist für die Berechnung nicht unbedingt notwendig)."},{"$f":"\"[gr]\"&E14","v":"[gr]Beschreiben Sie auf Basis des Arbeitsbuchs in wenigen Stichworten Ist-Zustand und Verbesserungspotenzial für die verschiedenen Aspekte (optional, ist für die Berechnung nicht unbedingt notwendig)."}]
[13,null,null,{"$f":"HLOOKUP($C$1,$E$1:$X$4910,ROW(D15))","v":"Based on these descriptions, indicate on a scale of 0-10 how far you consider the respective aspect is met (Achievement level). The criteria for choosing the correct value can be found in the Workbook."},"Geben Sie - aufbauend auf diesen Beschreibungen - an, entsprechend welchem Skalenwert (0-10) Ihrer Meinung nach der jeweilige Aspekt erfüllt ist (Spalte \"Erfüllungsgrad\"). Anhaltspunkte zur Wahl des \"richtigen\" Skalenwerts finden Sie wiederum im Arbeitsbuch.","In base a queste descrizioni, indica in base a quale valore di scala (0-10) pensi che il rispettivo aspetto sia soddisfatto (colonna \"grado di realizzazione\"). Troverete indizi per scegliere il valore di scala \"corretto\" nella cartella di lavoro.","Based on these descriptions, indicate on a scale of 0-10 how far you consider the respective aspect is met (Achievement level). The criteria for choosing the correct value can be found in the Workbook.","A partir de las descripciones previas, introduzca una puntuación de 0 a 10 que indique, según su opinión, el nivel de satisfacción de cada aspecto. Los niveles de referencia para la puntuación y otras indicaciones al respecto se encuentran en el manual.",{"$f":"\"[fr]\"&E15","v":"[fr]Geben Sie - aufbauend auf diesen Beschreibungen - an, entsprechend welchem Skalenwert (0-10) Ihrer Meinung nach der jeweilige Aspekt erfüllt ist (Spalte \"Erfüllungsgrad\"). Anhaltspunkte zur Wahl des \"richtigen\" Skalenwerts finden Sie wiederum im Arbeitsbuch."},{"$f":"\"[pt]\"&E15","v":"[pt]Geben Sie - aufbauend auf diesen Beschreibungen - an, entsprechend welchem Skalenwert (0-10) Ihrer Meinung nach der jeweilige Aspekt erfüllt ist (Spalte \"Erfüllungsgrad\"). Anhaltspunkte zur Wahl des \"richtigen\" Skalenwerts finden Sie wiederum im Arbeitsbuch."},{"$f":"\"[gr]\"&E15","v":"[gr]Geben Sie - aufbauend auf diesen Beschreibungen - an, entsprechend welchem Skalenwert (0-10) Ihrer Meinung nach der jeweilige Aspekt erfüllt ist (Spalte \"Erfüllungsgrad\"). Anhaltspunkte zur Wahl des \"richtigen\" Skalenwerts finden Sie wiederum im Arbeitsbuch."}]
[14,null,null,{"$f":"HLOOKUP($C$1,$E$1:$X$4910,ROW(D16))","v":"Negative aspects are allocated negative points according to the descriptions set out in the Workbook."},"Für die Bewertung der Negativaspekte geben Sie Punktewerte entsprechend der Beschreibungen im Arbeitsbuch an. ","Per la valutazione degli aspetti negativi si indicano i valori dei punti in base alle descrizioni nel manuale.","Negative aspects are allocated negative points according to the descriptions set out in the Workbook.","Para aportar una puntuación a cada uno de los aspectos negativos utilice las indicaciones del manual.",{"$f":"\"[fr]\"&E16","v":"[fr]Für die Bewertung der Negativaspekte geben Sie Punktewerte entsprechend der Beschreibungen im Arbeitsbuch an."},{"$f":"\"[pt]\"&E16","v":"[pt]Für die Bewertung der Negativaspekte geben Sie Punktewerte entsprechend der Beschreibungen im Arbeitsbuch an."},{"$f":"\"[gr]\"&E16","v":"[gr]Für die Bewertung der Negativaspekte geben Sie Punktewerte entsprechend der Beschreibungen im Arbeitsbuch an."}]
[15,null,null,{"$f":"HLOOKUP($C$1,$E$1:$X$4910,ROW(D17))","v":"Where deemed necessary for your company and in agreement with the auditors you can change the relative weightings of individual aspects (A1.1, A1.2, ..). In the column Weighting, you can select values for each aspect. The distribution of available points for individual aspects will then be adjusted automatically, so that the total of all aspects of an indicator result in 100%."},"Sie können, wenn es für ihr Unternehmen notwendig erscheint, in Abstimmung mit der AuditorIn die relativen Gewichtungen der einzelnen Aspekte (A1.1, A1.2, ...) verändern. In der Spalte \"Gewichtung\" (\"Gew.\") können Sie für jeden Aspekt Werte auswählen. Die Verteilung der möglichen Punkte auf die einzelnen Aspekte wird dann automatisch angepasst, sodass die Summe aller Aspekte eines Themas immer 100% ergibt.","È possibile modificare le ponderazioni relative dei singoli aspetti (A1.1, A1.2, ...), se necessario per la propria azienda, in consultazione con l’auitor. Nella colonna \"Peso\", è possibile selezionare i valori per ogni aspetto. La distribuzione dei possibili punti sui singoli aspetti viene quindi regolata automaticamente, in modo che la somma di tutti gli aspetti di un argomento sia sempre al 100%.","Where deemed necessary for your company and in agreement with the auditors you can change the relative weightings of individual aspects (A1.1, A1.2, ..). In the column Weighting, you can select values for each aspect. The distribution of available points for individual aspects will then be adjusted automatically, so that the total of all aspects of an indicator result in 100%.","Puede cambiar las ponderaciones que realiza la hoja de cálculo por defecto, siempre y cuando la auditoría esté de acuerdo. En la columna “Ponderación” puede seleccionar una opción del catálogo. La distribución de los puntos de cada uno de los aspectos se realiza automáticamente, de tal manera que la suma de todos los aspectos del tema siempre tiene como resultado el 100%.",{"$f":"\"[fr]\"&E17","v":"[fr]Sie können, wenn es für ihr Unternehmen notwendig erscheint, in Abstimmung mit der AuditorIn die relativen Gewichtungen der einzelnen Aspekte (A1.1, A1.2, ...) verändern. In der Spalte \"Gewichtung\" (\"Gew.\") können Sie für jeden Aspekt Werte auswählen. Die Verteilung der möglichen Punkte auf die einzelnen Aspekte wird dann automatisch angepasst, sodass die Summe aller Aspekte eines Themas immer 100% ergibt."},{"$f":"\"[pt]\"&E17","v":"[pt]Sie können, wenn es für ihr Unternehmen notwendig erscheint, in Abstimmung mit der AuditorIn die relativen Gewichtungen der einzelnen Aspekte (A1.1, A1.2, ...) verändern. In der Spalte \"Gewichtung\" (\"Gew.\") können Sie für jeden Aspekt Werte auswählen. Die Verteilung der möglichen Punkte auf die einzelnen Aspekte wird dann automatisch angepasst, sodass die Summe aller Aspekte eines Themas immer 100% ergibt."},{"$f":"\"[gr]\"&E17","v":"[gr]Sie können, wenn es für ihr Unternehmen notwendig erscheint, in Abstimmung mit der AuditorIn die relativen Gewichtungen der einzelnen Aspekte (A1.1, A1.2, ...) verändern. In der Spalte \"Gewichtung\" (\"Gew.\") können Sie für jeden Aspekt Werte auswählen. Die Verteilung der möglichen Punkte auf die einzelnen Aspekte wird dann automatisch angepasst, sodass die Summe aller Aspekte eines Themas immer 100% ergibt."}]
[16,null,null,{"$f":"HLOOKUP($C$1,$E$1:$X$4910,ROW(D18))","v":"The calculation automatically weights each theme’s total value against the data in the ‘Company details’ section and rounds it to a whole-number multiple of 10%."},"Bei der Berechnung werden die Gesamtwerte pro Thema automatisch entsprechend der Angaben im Faktenblatt gewichtet und auf ganzzahlige Vielfache von 10% gerundet.","Nel calcolo, i totali per argomento vengono automaticamente ponderati in base alla scheda informativa e arrotondati ai multipli interi del 10%.","The calculation automatically weights each theme’s total value against the data in the ‘Company details’ section and rounds it to a whole-number multiple of 10%.","Los valores introducidos son ponderados de acuerdo a los datos introducidos en la hoja 2. Company Facts. El resultado es redondeado y presentado como número entero.",{"$f":"\"[fr]\"&E18","v":"[fr]Bei der Berechnung werden die Gesamtwerte pro Thema automatisch entsprechend der Angaben im Faktenblatt gewichtet und auf ganzzahlige Vielfache von 10% gerundet."},{"$f":"\"[pt]\"&E18","v":"[pt]Bei der Berechnung werden die Gesamtwerte pro Thema automatisch entsprechend der Angaben im Faktenblatt gewichtet und auf ganzzahlige Vielfache von 10% gerundet."},{"$f":"\"[gr]\"&E18","v":"[gr]Bei der Berechnung werden die Gesamtwerte pro Thema automatisch entsprechend der Angaben im Faktenblatt gewichtet und auf ganzzahlige Vielfache von 10% gerundet."}]
[{"$nulls":3},{"$f":"HLOOKUP($C$1,$E$1:$X$4910,ROW(D19))","v":"The ECG-Matrix displays your result in a table."},"Die \"GW-Matrix\" bietet einen tabellarischen Überblick über Ihr Ergebnis.","La \"matrice EBC\" fornisce una panoramica tabellare del risultato.","The ECG-Matrix displays your result in a table.","La hoja “ECG-Matrix” muestra los resultados en una tabla resumen.",{"$f":"\"[fr]\"&E19","v":"[fr]Die \"GW-Matrix\" bietet einen tabellarischen Überblick über Ihr Ergebnis."},{"$f":"\"[pt]\"&E19","v":"[pt]Die \"GW-Matrix\" bietet einen tabellarischen Überblick über Ihr Ergebnis."},{"$f":"\"[gr]\"&E19","v":"[gr]Die \"GW-Matrix\" bietet einen tabellarischen Überblick über Ihr Ergebnis."}]
[{"$nulls":3},{"$f":"HLOOKUP($C$1,$E$1:$X$4910,ROW(D20))","v":"The ECG Matrix displays your result in a table."},"Die \"GW-Matrix\" bietet einen tabellarischen Blick auf Ihr Ergebnis.","La \"matrice EBC\" offre una vista tabellare del risultato.","The ECG Matrix displays your result in a table.","La hoja “ECG-Matrix” muestra los resultados de la puntuación presentando una vista general en forma de matriz (tabla).",{"$f":"\"[fr]\"&E20","v":"[fr]Die \"GW-Matrix\" bietet einen tabellarischen Blick auf Ihr Ergebnis."},{"$f":"\"[pt]\"&E20","v":"[pt]Die \"GW-Matrix\" bietet einen tabellarischen Blick auf Ihr Ergebnis."},{"$f":"\"[gr]\"&E20","v":"[gr]Die \"GW-Matrix\" bietet einen tabellarischen Blick auf Ihr Ergebnis."}]
[{"$nulls":3},{"$f":"HLOOKUP($C$1,$E$1:$X$4910,ROW(D21))","v":"The values-star displays your result arranged by value as a graphic."},"Der \"Werte-Stern\" zeigt schließlich Ihr Ergebnis nach Werten gegliedert in graphischer Form.","La \"stella dei valori\" mostra infine il risultato in base a valori strutturati in forma grafica.","The values-star displays your result arranged by value as a graphic.","La hoja “Values” muestra un diagrama de araña en el que se muestran las puntuaciones según “valor” o columna de la matriz.",{"$f":"\"[fr]\"&E21","v":"[fr]Der \"Werte-Stern\" zeigt schließlich Ihr Ergebnis nach Werten gegliedert in graphischer Form."},{"$f":"\"[pt]\"&E21","v":"[pt]Der \"Werte-Stern\" zeigt schließlich Ihr Ergebnis nach Werten gegliedert in graphischer Form."},{"$f":"\"[gr]\"&E21","v":"[gr]Der \"Werte-Stern\" zeigt schließlich Ihr Ergebnis nach Werten gegliedert in graphischer Form."}]
[{"$nulls":3},{"$f":"HLOOKUP($C$1,$E$1:$X$4910,ROW(D22))","v":"The group-star displays your result arranged by stakeholder as a graphic."},"Der \"Gruppen-Stern\" zeigt schließlich Ihr Ergebnis nach Berührungsgruppen gegliedert in graphischer Form.","La \"stella dei gruppi\" mostra infine il risultato in base a gruppi d’interesse  strutturati in forma grafica.","The group-star displays your result arranged by stakeholder as a graphic.","La hoja “Stakeholders” muestra un diagrama de araña en el que se muestran las puntuaciones según “grupo de interés” o fila de la matriz.",{"$f":"\"[fr]\"&E22","v":"[fr]Der \"Gruppen-Stern\" zeigt schließlich Ihr Ergebnis nach Berührungsgruppen gegliedert in graphischer Form."},{"$f":"\"[pt]\"&E22","v":"[pt]Der \"Gruppen-Stern\" zeigt schließlich Ihr Ergebnis nach Berührungsgruppen gegliedert in graphischer Form."},{"$f":"\"[gr]\"&E22","v":"[gr]Der \"Gruppen-Stern\" zeigt schließlich Ihr Ergebnis nach Berührungsgruppen gegliedert in graphischer Form."}]
[{"$nulls":3},{"$f":"HLOOKUP($C$1,$E$1:$X$4910,ROW(D23))","v":"The theme-star displays the result of your themes as a graphic."},"Der \"Themen-Stern\" zeigt schließlich Ihr Ergebnis in allen Themen in graphischer Form.","La \"stella dei temi\" mostra finalmente il risultato in tutti i temi in forma grafica.","The theme-star displays the result of your themes as a graphic.","La hoja “Topics” muestra un diagrama de araña en el que se muestran las puntuaciones de cada tema.",{"$f":"\"[fr]\"&E23","v":"[fr]Der \"Themen-Stern\" zeigt schließlich Ihr Ergebnis in allen Themen in graphischer Form."},{"$f":"\"[pt]\"&E23","v":"[pt]Der \"Themen-Stern\" zeigt schließlich Ihr Ergebnis in allen Themen in graphischer Form."},{"$f":"\"[gr]\"&E23","v":"[gr]Der \"Themen-Stern\" zeigt schließlich Ihr Ergebnis in allen Themen in graphischer Form."}]
[{"$nulls":3},{"$f":"HLOOKUP($C$1,$E$1:$X$4910,ROW(D24))","v":"This is a description of the weighting model."},"Hier finden Sie eine Beschreibung der Gewichtungsmodelles. ","Qui potete trovare una descrizione del modello di ponderazione.","This is a description of the weighting model.","En la hoja “Descr. Weighting” se encuentra una descripción del método de ponderación.",{"$f":"\"[fr]\"&E24","v":"[fr]Hier finden Sie eine Beschreibung der Gewichtungsmodelles."},{"$f":"\"[pt]\"&E24","v":"[pt]Hier finden Sie eine Beschreibung der Gewichtungsmodelles."},{"$f":"\"[gr]\"&E24","v":"[gr]Hier finden Sie eine Beschreibung der Gewichtungsmodelles."}]
[{"$nulls":3},{"$f":"HLOOKUP($C$1,$E$1:$X$4910,ROW(D25))","v":"This is where the calculation determines how the individual stakeholder groups and themes are weighted."},"Hier erfolgt die Berechnung wie die einzelnen Berührungsgruppen und Themen gewichtet werden.","Qui il calcolo avviene come vengono pesati i singoli gruppi d’interesse ed i temi.","This is where the calculation determines how the individual stakeholder groups and themes are weighted.","En la hoja “Weighting” se realiza el cálculo para las ponderaciones de los grupos de interés y temas.",{"$f":"\"[fr]\"&E25","v":"[fr]Hier erfolgt die Berechnung wie die einzelnen Berührungsgruppen und Themen gewichtet werden."},{"$f":"\"[pt]\"&E25","v":"[pt]Hier erfolgt die Berechnung wie die einzelnen Berührungsgruppen und Themen gewichtet werden."},{"$f":"\"[gr]\"&E25","v":"[gr]Hier erfolgt die Berechnung wie die einzelnen Berührungsgruppen und Themen gewichtet werden."}]
[{"$nulls":3},{"$f":"HLOOKUP($C$1,$E$1:$X$4910,ROW(D26))","v":"This contains an assessment of the relevance of supply chains and environmental sustainability for all industry sectors, used in the weighting."},"Enthält Einschätzungen der Relevanz von Zulieferkette und ökologische Nachhaltigkeit für alle Branchen,, die für die Gewichtung herangezogen werden. ","Include stime della dell'importanza della rete dei fornitori e della sostenibilità ambientale per tutti i settori utilizzati per la ponderazione.","This contains an assessment of the relevance of supply chains and environmental sustainability for all industry sectors, used in the weighting.","Esta hoja contiene estimaciones sobre la relevancia de la cadena de suministro y sostenibilidad medioambiental de todos los sectores. Esta información se utiliza para realizar la ponderación.",{"$f":"\"[fr]\"&E26","v":"[fr]Enthält Einschätzungen der Relevanz von Zulieferkette und ökologische Nachhaltigkeit für alle Branchen,, die für die Gewichtung herangezogen werden."},{"$f":"\"[pt]\"&E26","v":"[pt]Enthält Einschätzungen der Relevanz von Zulieferkette und ökologische Nachhaltigkeit für alle Branchen,, die für die Gewichtung herangezogen werden."},{"$f":"\"[gr]\"&E26","v":"[gr]Enthält Einschätzungen der Relevanz von Zulieferkette und ökologische Nachhaltigkeit für alle Branchen,, die für die Gewichtung herangezogen werden."}]
[{"$nulls":3},{"$f":"HLOOKUP($C$1,$E$1:$X$4910,ROW(D27))","v":"This contains statistics for countries and regions used in the weighting."},"Enthält Statistiken für Länder und Regionen, die für die Gewichtung herangezogen werden. ","Contiene statistiche per paesi e regioni utilizzati per la ponderazione.","This contains statistics for countries and regions used in the weighting.","Esta hoja contiene estadísticas de países y regiones que son utilizadas para realizar las ponderaciones.",{"$f":"\"[fr]\"&E27","v":"[fr]Enthält Statistiken für Länder und Regionen, die für die Gewichtung herangezogen werden."},{"$f":"\"[pt]\"&E27","v":"[pt]Enthält Statistiken für Länder und Regionen, die für die Gewichtung herangezogen werden."},{"$f":"\"[gr]\"&E27","v":"[gr]Enthält Statistiken für Länder und Regionen, die für die Gewichtung herangezogen werden."}]
[{"$nulls":3},{"$f":"HLOOKUP($C$1,$E$1:$X$4910,ROW(D28))","v":"2. Company details"},"2. Fakten zum Unternehmen","2. Fatti sull'impresa","2. Company details","2. Datos de la empresa",{"$f":"\"[fr]\"&E28","v":"[fr]2. Fakten zum Unternehmen"},{"$f":"\"[pt]\"&E28","v":"[pt]2. Fakten zum Unternehmen"},{"$f":"\"[gr]\"&E28","v":"[gr]2. Fakten zum Unternehmen"}]
[{"$nulls":3},{"$f":"HLOOKUP($C$1,$E$1:$X$4910,ROW(D29))","v":"3. Scoring"},"3. Berechnung","3. calcolo","3. Scoring","3. Cálculo",{"$f":"\"[fr]\"&E29","v":"[fr]3. Berechnung"},{"$f":"\"[pt]\"&E29","v":"[pt]3. Berechnung"},{"$f":"\"[gr]\"&E29","v":"[gr]3. Berechnung"}]
[{"$nulls":3},{"$f":"HLOOKUP($C$1,$E$1:$X$4910,ROW(D30))","v":"4. ECG Matrix"},"4. GW-Matrix","4. matrice del bene comune","4. ECG Matrix","4. Matriz EBC",{"$f":"\"[fr]\"&E30","v":"[fr]4. GW-Matrix"},{"$f":"\"[pt]\"&E30","v":"[pt]4. GW-Matrix"},{"$f":"\"[gr]\"&E30","v":"[gr]4. GW-Matrix"}]
[{"$nulls":3},{"$f":"HLOOKUP($C$1,$E$1:$X$4910,ROW(D31))","v":"5. Values star"},"5. Werte-Stern","5. valori stella","5. Values star","5. Diagrama valores",{"$f":"\"[fr]\"&E31","v":"[fr]5. Werte-Stern"},{"$f":"\"[pt]\"&E31","v":"[pt]5. Werte-Stern"},{"$f":"\"[gr]\"&E31","v":"[gr]5. Werte-Stern"}]
[{"$nulls":3},{"$f":"HLOOKUP($C$1,$E$1:$X$4910,ROW(D32))","v":"6. Group star"},"6. Gruppen-Stern","6. gruppi stella","6. Group star","6. Diagrama grupos de interés",{"$f":"\"[fr]\"&E32","v":"[fr]6. Gruppen-Stern"},{"$f":"\"[pt]\"&E32","v":"[pt]6. Gruppen-Stern"},{"$f":"\"[gr]\"&E32","v":"[gr]6. Gruppen-Stern"}]
[{"$nulls":3},{"$f":"HLOOKUP($C$1,$E$1:$X$4910,ROW(D33))","v":"7. Theme star"},"7. Themen-Stern","7. argomenti stella","7. Theme star","7. Diagrama temas",{"$f":"\"[fr]\"&E33","v":"[fr]7. Themen-Stern"},{"$f":"\"[pt]\"&E33","v":"[pt]7. Themen-Stern"},{"$f":"\"[gr]\"&E33","v":"[gr]7. Themen-Stern"}]
[{"$nulls":3},{"$f":"HLOOKUP($C$1,$E$1:$X$4910,ROW(D34))","v":"8. Weighting model description"},"8. Beschreibung Gewichtungsmodell","8. Modello di ponderazione della descrizione","8. Weighting model description","8. Descripción del método de ponderación",{"$f":"\"[fr]\"&E34","v":"[fr]8. Beschreibung Gewichtungsmodell"},{"$f":"\"[pt]\"&E34","v":"[pt]8. Beschreibung Gewichtungsmodell"},{"$f":"\"[gr]\"&E34","v":"[gr]8. Beschreibung Gewichtungsmodell"}]
[{"$nulls":3},{"$f":"HLOOKUP($C$1,$E$1:$X$4910,ROW(D35))","v":"9. Weighting (hidden)"},"9. Gewichtung (ausgeblendet)","9. Ponderazione (nascosta)","9. Weighting (hidden)","9. Ponderación (oculta)",{"$f":"\"[fr]\"&E35","v":"[fr]9. Gewichtung (ausgeblendet)"},{"$f":"\"[pt]\"&E35","v":"[pt]9. Gewichtung (ausgeblendet)"},{"$f":"\"[gr]\"&E35","v":"[gr]9. Gewichtung (ausgeblendet)"}]
[{"$nulls":3},{"$f":"HLOOKUP($C$1,$E$1:$X$4910,ROW(D36))","v":"10. Industry sectors (hidden)"},"10. Branchen (ausgeblendet)","10. Settori (nascosti)","10. Industry sectors (hidden)","10. Sectores (oculta)",{"$f":"\"[fr]\"&E36","v":"[fr]10. Branchen (ausgeblendet)"},{"$f":"\"[pt]\"&E36","v":"[pt]10. Branchen (ausgeblendet)"},{"$f":"\"[gr]\"&E36","v":"[gr]10. Branchen (ausgeblendet)"}]
[{"$nulls":3},{"$f":"HLOOKUP($C$1,$E$1:$X$4910,ROW(D37))","v":"11. Countries (hidden)"},"11. Länder und Regionen (ausgeblendet)","11. Paesi e regioni (nascosti)","11. Countries (hidden)","11. Países y regiones (oculta)",{"$f":"\"[fr]\"&E37","v":"[fr]11. Länder und Regionen (ausgeblendet)"},{"$f":"\"[pt]\"&E37","v":"[pt]11. Länder und Regionen (ausgeblendet)"},{"$f":"\"[gr]\"&E37","v":"[gr]11. Länder und Regionen (ausgeblendet)"}]
[]
[{"$nulls":3},{"$f":"HLOOKUP($C$1,$E$1:$X$4910,ROW(D39))","v":0}]
[{"$nulls":3},{"$f":"HLOOKUP($C$1,$E$1:$X$4910,ROW(D40))","v":"KEY"},"LEGENDE","LEGENDA","KEY","LEYENDA",{"$f":"\"[fr]\"&E40","v":"[fr]LEGENDE"},{"$f":"\"[pt]\"&E40","v":"[pt]LEGENDE"},{"$f":"\"[gr]\"&E40","v":"[gr]LEGENDE"}]
[{"$nulls":3},{"$f":"HLOOKUP($C$1,$E$1:$X$4910,ROW(D41))","v":"Field is editable (green frame, dark green text)"},"Feld ist beschreibbar (grüner Rahmen, dunkelgrüne Schrift)","Il campo è descrivibile (cornici nere, scritta verde scuro)","Field is editable (green frame, dark green text)","Celda editable (borde verde, letra verde oscura)",{"$f":"\"[fr]\"&E41","v":"[fr]Feld ist beschreibbar (grüner Rahmen, dunkelgrüne Schrift)"},{"$f":"\"[pt]\"&E41","v":"[pt]Feld ist beschreibbar (grüner Rahmen, dunkelgrüne Schrift)"},{"$f":"\"[gr]\"&E41","v":"[gr]Feld ist beschreibbar (grüner Rahmen, dunkelgrüne Schrift)"}]
[{"$nulls":3},{"$f":"HLOOKUP($C$1,$E$1:$X$4910,ROW(D42))","v":"Feld is read-only (grey frame, dark grey text)"},"Feld ist nicht beschreibbar (grauer Rahmen, dunkelgraue Schrift)","Il campo non è descrivibile (cornice grigia, scritta grigio scuro)","Feld is read-only (grey frame, dark grey text)","Celda protegida (borde gris, letra gris oscura)",{"$f":"\"[fr]\"&E42","v":"[fr]Feld ist nicht beschreibbar (grauer Rahmen, dunkelgraue Schrift)"},{"$f":"\"[pt]\"&E42","v":"[pt]Feld ist nicht beschreibbar (grauer Rahmen, dunkelgraue Schrift)"},{"$f":"\"[gr]\"&E42","v":"[gr]Feld ist nicht beschreibbar (grauer Rahmen, dunkelgraue Schrift)"}]
[{"$nulls":3},{"$f":"HLOOKUP($C$1,$E$1:$X$4910,ROW(D43))","v":"non valid value entry (for correct calculation change value)"},"unerlaubter Wert eingegeben (zur korrekten Berechnung Wert ändern)","È stato inserito un valore non permesso (per un calcolo corretto cambiare valore)","non valid value entry (for correct calculation change value)","Valor erróneo (cambie el valor para realizar un cálculo correcto)",{"$f":"\"[fr]\"&E43","v":"[fr]unerlaubter Wert eingegeben (zur korrekten Berechnung Wert ändern)"},{"$f":"\"[pt]\"&E43","v":"[pt]unerlaubter Wert eingegeben (zur korrekten Berechnung Wert ändern)"},{"$f":"\"[gr]\"&E43","v":"[gr]unerlaubter Wert eingegeben (zur korrekten Berechnung Wert ändern)"}]
[{"$nulls":3},{"$f":"HLOOKUP($C$1,$E$1:$X$4910,ROW(D44))","v":"Values are not consistent"},"fehlerhafte Eingabe","fehlerhafte Eingabe","Values are not consistent","Los valores no son consistentes",{"$f":"\"[fr]\"&E44","v":"[fr]fehlerhafte Eingabe"},{"$f":"\"[pt]\"&E44","v":"[pt]fehlerhafte Eingabe"},{"$f":"\"[gr]\"&E44","v":"[gr]fehlerhafte Eingabe"}]
[{"$nulls":3},{"$f":"HLOOKUP($C$1,$E$1:$X$4910,ROW(D45))","v":0}]
[{"$nulls":3},{"$f":"HLOOKUP($C$1,$E$1:$X$4910,ROW(D46))","v":0}]
[{"$nulls":3},{"$f":"HLOOKUP($C$1,$E$1:$X$4910,ROW(D47))","v":0}]
[{"$nulls":3},{"$f":"HLOOKUP($C$1,$E$1:$X$4910,ROW(D48))","v":0}]
[{"$nulls":3},{"$f":"HLOOKUP($C$1,$E$1:$X$4910,ROW(D49))","v":0}]
[{"$nulls":3},{"$f":"HLOOKUP($C$1,$E$1:$X$4910,ROW(D50))","v":0}]
[{"$nulls":3},{"$f":"HLOOKUP($C$1,$E$1:$X$4910,ROW(D51))","v":0}]
[{"$nulls":3},{"$f":"HLOOKUP($C$1,$E$1:$X$4910,ROW(D52))","v":"yes"},"ja","si","yes","Sí",{"$f":"\"[fr]\"&E52","v":"[fr]ja"},{"$f":"\"[pt]\"&E52","v":"[pt]ja"},{"$f":"\"[gr]\"&E52","v":"[gr]ja"}]
[{"$nulls":3},{"$f":"HLOOKUP($C$1,$E$1:$X$4910,ROW(D53))","v":"no"},"nein","no","no","No","Pas","Nao",{"$f":"\"[gr]\"&E53","v":"[gr]nein"}]
[{"$nulls":3},{"$f":"HLOOKUP($C$1,$E$1:$X$4910,ROW(D54))","v":"CONTACT"},"KONTAKT","CONTATTO","CONTACT","CONTACTO",{"$f":"\"[fr]\"&E54","v":"[fr]KONTAKT"},{"$f":"\"[pt]\"&E54","v":"[pt]KONTAKT"},{"$f":"\"[gr]\"&E54","v":"[gr]KONTAKT"}]
[{"$nulls":3},{"$f":"HLOOKUP($C$1,$E$1:$X$4910,ROW(D55))","v":"Questions regarding preparation of balance sheet:\nberatung@gemeinwohl-oekonomie.org (GWÖ-BeraterInnen);"},"Fragen zur Bilanz-Erstellung: beratung@gemeinwohl-oekonomie.org (GWÖ-BeraterInnen);","Domande per il bilancio: info@economia-del-ben-comune.it (consulenti EBC)","Questions regarding preparation of balance sheet:\nberatung@gemeinwohl-oekonomie.org (GWÖ-BeraterInnen);","Preguntas sobre como elaborar el balance del Bien Común: nodo-empresas@economia-del-bien-comun.es",{"$f":"\"[fr]\"&E55","v":"[fr]Fragen zur Bilanz-Erstellung: beratung@gemeinwohl-oekonomie.org (GWÖ-BeraterInnen);"},{"$f":"\"[pt]\"&E55","v":"[pt]Fragen zur Bilanz-Erstellung: beratung@gemeinwohl-oekonomie.org (GWÖ-BeraterInnen);"},{"$f":"\"[gr]\"&E55","v":"[gr]Fragen zur Bilanz-Erstellung: beratung@gemeinwohl-oekonomie.org (GWÖ-BeraterInnen);"}]
[{"$nulls":3},{"$f":"HLOOKUP($C$1,$E$1:$X$4910,ROW(D56))","v":"Questions regarding audit: audit@gemeinwohl-oekonomie.org (GWÖ-AuditorInnen);"},"Fragen zur Auditierung: audit@gemeinwohl-oekonomie.org (GWÖ-AuditorInnen);","Domande per l'audit: audit@febc.eu (Verificatori/auditori EBC)","Questions regarding audit: audit@gemeinwohl-oekonomie.org (GWÖ-AuditorInnen);","Preguntas sobre la auditoría: nodo-empresas@economia-del-bien-comun.es",{"$f":"\"[fr]\"&E56","v":"[fr]Fragen zur Auditierung: audit@gemeinwohl-oekonomie.org (GWÖ-AuditorInnen);"},{"$f":"\"[pt]\"&E56","v":"[pt]Fragen zur Auditierung: audit@gemeinwohl-oekonomie.org (GWÖ-AuditorInnen);"},{"$f":"\"[gr]\"&E56","v":"[gr]Fragen zur Auditierung: audit@gemeinwohl-oekonomie.org (GWÖ-AuditorInnen);"}]
[{"$nulls":3},{"$f":"HLOOKUP($C$1,$E$1:$X$4910,ROW(D57))","v":"Feedback on the development of the Matrix: bilanz@ecogood.org (Matrix Development Team)"},"Weiterentwicklung der Matrix: bilanz@ecogood.org (GWÖ-Matrix Entwicklungsteam);",{"$f":"\"[it]\"&E57","v":"[it]Weiterentwicklung der Matrix: bilanz@ecogood.org (GWÖ-Matrix Entwicklungsteam);"},"Feedback on the development of the Matrix: bilanz@ecogood.org (Matrix Development Team)","Desarrollo de la matriz: bilanz@ecogood.org (Equipo de desarrollo de la matriz EBC)",{"$f":"\"[fr]\"&E57","v":"[fr]Weiterentwicklung der Matrix: bilanz@ecogood.org (GWÖ-Matrix Entwicklungsteam);"},{"$f":"\"[pt]\"&E57","v":"[pt]Weiterentwicklung der Matrix: bilanz@ecogood.org (GWÖ-Matrix Entwicklungsteam);"},{"$f":"\"[gr]\"&E57","v":"[gr]Weiterentwicklung der Matrix: bilanz@ecogood.org (GWÖ-Matrix Entwicklungsteam);"}]
[{"$nulls":3},{"$f":"HLOOKUP($C$1,$E$1:$X$4910,ROW(D58))","v":"Excel programming: Christian Loy (christian.loy@gmx.at); Christian Kozina; Multilanguage tool: Bernhard Oberrauch"},"Excel-Programmierung: Christian Loy (christian.loy@gmx.at); Christian Kozina; Multilanguage-tool: Bernhard Oberrauch","Programmazione Excel: Christian Loy (christian.loy@gmx.at); Christian Kozina; Multilanguage-tool: Bernhard Oberrauch (info@a-bo.net)","Excel programming: Christian Loy (christian.loy@gmx.at); Christian Kozina; Multilanguage tool: Bernhard Oberrauch","Programación en Excel: Christian Loy (christian.loy@gmx.at);Christian Kozina; Multilanguage-tool: Bernhard Oberrauch",{"$f":"\"[fr]\"&E58","v":"[fr]Excel-Programmierung: Christian Loy (christian.loy@gmx.at); Christian Kozina; Multilanguage-tool: Bernhard Oberrauch"},{"$f":"\"[pt]\"&E58","v":"[pt]Excel-Programmierung: Christian Loy (christian.loy@gmx.at); Christian Kozina; Multilanguage-tool: Bernhard Oberrauch"},{"$f":"\"[gr]\"&E58","v":"[gr]Excel-Programmierung: Christian Loy (christian.loy@gmx.at); Christian Kozina; Multilanguage-tool: Bernhard Oberrauch"}]
[{"$nulls":3},{"$f":"HLOOKUP($C$1,$E$1:$X$4910,ROW(D59))","v":"Contents: ECG-Matrix Development Team"},"Inhalte: GWÖ-Matrix Entwicklungsteam",{"$f":"\"[it]\"&E59","v":"[it]Inhalte: GWÖ-Matrix Entwicklungsteam"},"Contents: ECG-Matrix Development Team","Contenido: Equipo de desarrollo de la matriz EBC",{"$f":"\"[fr]\"&E59","v":"[fr]Inhalte: GWÖ-Matrix Entwicklungsteam"},{"$f":"\"[pt]\"&E59","v":"[pt]Inhalte: GWÖ-Matrix Entwicklungsteam"},{"$f":"\"[gr]\"&E59","v":"[gr]Inhalte: GWÖ-Matrix Entwicklungsteam"}]
[{"$nulls":3},{"$f":"HLOOKUP($C$1,$E$1:$X$4910,ROW(D60))","v":"NOTES"},"ANMERKUNGEN","ANNOTAZIONI","NOTES","NOTAS ACLARATORIAS",{"$f":"\"[fr]\"&E60","v":"[fr]ANMERKUNGEN"},{"$f":"\"[pt]\"&E60","v":"[pt]ANMERKUNGEN"},{"$f":"\"[gr]\"&E60","v":"[gr]ANMERKUNGEN"}]
[{"$nulls":3},{"$f":"HLOOKUP($C$1,$E$1:$X$4910,ROW(D61))","v":"All sheets are optimised for printing on A4 format (landscape or portrait).\nThe height of rows can be adjusted, if you enter more text"},"Alle Tabellen sind optimiert für den Ausdruck auf A4 (Hoch- oder Querformat).\nDie Höhe der Zeilen ist veränderbar, falls Sie mehr Text eingeben wollen.","Tutte le tabelle sono ottimizzate per la stampa in A4 (verticale o orizzontale).\nL’Altezza delle celle è modificabile, nel caso Lei dovesse inserire più testo.","All sheets are optimised for printing on A4 format (landscape or portrait).\nThe height of rows can be adjusted, if you enter more text","Todas las hojas están editadas de tal manera que puedan imprimirse en un A4 (horizontal o vertical).\nSi necesita más espacio para añadir más texto puede cambiar la altura de las filas.",{"$f":"\"[fr]\"&E61","v":"[fr]Alle Tabellen sind optimiert für den Ausdruck auf A4 (Hoch- oder Querformat).\nDie Höhe der Zeilen ist veränderbar, falls Sie mehr Text eingeben wollen."},{"$f":"\"[pt]\"&E61","v":"[pt]Alle Tabellen sind optimiert für den Ausdruck auf A4 (Hoch- oder Querformat).\nDie Höhe der Zeilen ist veränderbar, falls Sie mehr Text eingeben wollen."},{"$f":"\"[gr]\"&E61","v":"[gr]Alle Tabellen sind optimiert für den Ausdruck auf A4 (Hoch- oder Querformat).\nDie Höhe der Zeilen ist veränderbar, falls Sie mehr Text eingeben wollen."}]
[{"$nulls":3},{"$f":"HLOOKUP($C$1,$E$1:$X$4910,ROW(D62))","v":"GENERAL INFORMATION ABOUT THE COMPANY"},"ALLGEMEINE ANGABEN ZUM UNTERNEHMEN","Dati dell'impresa","GENERAL INFORMATION ABOUT THE COMPANY","INFORMACIÓN GENERAL SOBRE LA EMPRESA",{"$f":"\"[fr]\"&E62","v":"[fr]ALLGEMEINE ANGABEN ZUM UNTERNEHMEN"},{"$f":"\"[pt]\"&E62","v":"[pt]ALLGEMEINE ANGABEN ZUM UNTERNEHMEN"},{"$f":"\"[gr]\"&E62","v":"[gr]ALLGEMEINE ANGABEN ZUM UNTERNEHMEN"}]
[{"$nulls":3},{"$f":"HLOOKUP($C$1,$E$1:$X$4910,ROW(D63))","v":"Please complete all fields."},"Bitte vollständig ausfüllen!","Per favore compili completamente!","Please complete all fields.","Por favor introduzca todos los datos",{"$f":"\"[fr]\"&E63","v":"[fr]Bitte vollständig ausfüllen!"},{"$f":"\"[pt]\"&E63","v":"[pt]Bitte vollständig ausfüllen!"},{"$f":"\"[gr]\"&E63","v":"[gr]Bitte vollständig ausfüllen!"}]
[{"$nulls":3},{"$f":"HLOOKUP($C$1,$E$1:$X$4910,ROW(D64))","v":"Name of Company / Organisation:"},"Name des Unternehmens:","Nome dell'impresa:","Name of Company / Organisation:","Nombre de la empresa:",{"$f":"\"[fr]\"&E64","v":"[fr]Name des Unternehmens:"},{"$f":"\"[pt]\"&E64","v":"[pt]Name des Unternehmens:"},{"$f":"\"[gr]\"&E64","v":"[gr]Name des Unternehmens:"}]
[{"$nulls":3},{"$f":"HLOOKUP($C$1,$E$1:$X$4910,ROW(D65))","v":"Address:"},"Anschrift:","Indirizzo:","Address:","Dirección:",{"$f":"\"[fr]\"&E65","v":"[fr]Anschrift:"},{"$f":"\"[pt]\"&E65","v":"[pt]Anschrift:"},{"$f":"\"[gr]\"&E65","v":"[gr]Anschrift:"}]
[{"$nulls":3},{"$f":"HLOOKUP($C$1,$E$1:$X$4910,ROW(D66))","v":"Country:"},"Staat:","Stato:","Country:","Estado:",{"$f":"\"[fr]\"&E66","v":"[fr]Staat:"},{"$f":"\"[pt]\"&E66","v":"[pt]Staat:"},{"$f":"\"[gr]\"&E66","v":"[gr]Staat:"}]
[{"$nulls":3},{"$f":"HLOOKUP($C$1,$E$1:$X$4910,ROW(D67))","v":"Industry sector:"},"Branche:","Settore:","Industry sector:","Sector:",{"$f":"\"[fr]\"&E67","v":"[fr]Branche:"},{"$f":"\"[pt]\"&E67","v":"[pt]Branche:"},{"$f":"\"[gr]\"&E67","v":"[gr]Branche:"}]
[{"$nulls":3},{"$f":"HLOOKUP($C$1,$E$1:$X$4910,ROW(D68))","v":"Website:"},"Website:","Sito web:","Website:","Página web:",{"$f":"\"[fr]\"&E68","v":"[fr]Website:"},{"$f":"\"[pt]\"&E68","v":"[pt]Website:"},{"$f":"\"[gr]\"&E68","v":"[gr]Website:"}]
[{"$nulls":3},{"$f":"HLOOKUP($C$1,$E$1:$X$4910,ROW(D69))","v":"Number of employees"},"Anzahl der MitarbeiterInnen:","Presenza adetti","Number of employees","Número de trabajadores:",{"$f":"\"[fr]\"&E69","v":"[fr]Anzahl der MitarbeiterInnen:"},{"$f":"\"[pt]\"&E69","v":"[pt]Anzahl der MitarbeiterInnen:"},{"$f":"\"[gr]\"&E69","v":"[gr]Anzahl der MitarbeiterInnen:"}]
[{"$nulls":3},{"$f":"HLOOKUP($C$1,$E$1:$X$4910,ROW(D70))","v":"Sole trader (ST) (or single-person)"},"Ein-Personen-Unternehmen:","Impresa \"di un collabpratore\":","Sole trader (ST) (or single-person)","Empresas unipersonales:",{"$f":"\"[fr]\"&E70","v":"[fr]Ein-Personen-Unternehmen:"},{"$f":"\"[pt]\"&E70","v":"[pt]Ein-Personen-Unternehmen:"},{"$f":"\"[gr]\"&E70","v":"[gr]Ein-Personen-Unternehmen:"}]
[{"$nulls":3},{"$f":"HLOOKUP($C$1,$E$1:$X$4910,ROW(D71))","v":"(Note: If yes, the values for STs will be filled in automatically for the calculation)"},"(Hinweis: Wenn ja, werden die für EPUs gültigen Werte automatisch in die Berechnung übernommen.)","(Attenzione: se la risposta è si, I valori validi per l’impresa individuale vengono accettati automaticamente nel calcolo.)","(Note: If yes, the values for STs will be filled in automatically for the calculation)","(Nota: si introduce sí, entonces se aplican algunos valores automáticos en la ponderación)",{"$f":"\"[fr]\"&E71","v":"[fr](Hinweis: Wenn ja, werden die für EPUs gültigen Werte automatisch in die Berechnung übernommen.)"},{"$f":"\"[pt]\"&E71","v":"[pt](Hinweis: Wenn ja, werden die für EPUs gültigen Werte automatisch in die Berechnung übernommen.)"},{"$f":"\"[gr]\"&E71","v":"[gr](Hinweis: Wenn ja, werden die für EPUs gültigen Werte automatisch in die Berechnung übernommen.)"}]
[{"$nulls":3},{"$f":"HLOOKUP($C$1,$E$1:$X$4910,ROW(D72))","v":"Balance year:"},"Bilanzjahr:","bilancio anno:","Balance year:","Año del balance:",{"$f":"\"[fr]\"&E72","v":"[fr]Bilanzjahr:"},{"$f":"\"[pt]\"&E72","v":"[pt]Bilanzjahr:"},{"$f":"\"[gr]\"&E72","v":"[gr]Bilanzjahr:"}]
[{"$nulls":3},{"$f":"HLOOKUP($C$1,$E$1:$X$4910,ROW(D73))","v":"Document created by:"},"ErstellerIn:","Compilatore/trice:","Document created by:","Redactor del balance:",{"$f":"\"[fr]\"&E73","v":"[fr]ErstellerIn:"},{"$f":"\"[pt]\"&E73","v":"[pt]ErstellerIn:"},{"$f":"\"[gr]\"&E73","v":"[gr]ErstellerIn:"}]
[{"$nulls":3},{"$f":"HLOOKUP($C$1,$E$1:$X$4910,ROW(D74))","v":"Email address:"},"E-Mail-Adresse:","indirizzo mail:","Email address:","E-mail:",{"$f":"\"[fr]\"&E74","v":"[fr]E-Mail-Adresse:"},{"$f":"\"[pt]\"&E74","v":"[pt]E-Mail-Adresse:"},{"$f":"\"[gr]\"&E74","v":"[gr]E-Mail-Adresse:"}]
[{"$nulls":3},{"$f":"HLOOKUP($C$1,$E$1:$X$4910,ROW(D75))","v":"Phone number:"},"Telefonnummer:","numero di telefono:","Phone number:","Teléfono:",{"$f":"\"[fr]\"&E75","v":"[fr]Telefonnummer:"},{"$f":"\"[pt]\"&E75","v":"[pt]Telefonnummer:"},{"$f":"\"[gr]\"&E75","v":"[gr]Telefonnummer:"}]
[{"$nulls":3},{"$f":"HLOOKUP($C$1,$E$1:$X$4910,ROW(D76))","v":"Consultant:"},"BeraterIn:","Consulente:","Consultant:","Consultor/a:",{"$f":"\"[fr]\"&E76","v":"[fr]BeraterIn:"},{"$f":"\"[pt]\"&E76","v":"[pt]BeraterIn:"},{"$f":"\"[gr]\"&E76","v":"[gr]BeraterIn:"}]
[{"$nulls":3},{"$f":"HLOOKUP($C$1,$E$1:$X$4910,ROW(D77))","v":"E-mail address:"},"E-Mail-Adresse:","indirizzo mail:","E-mail address:","E-mail:",{"$f":"\"[fr]\"&E77","v":"[fr]E-Mail-Adresse:"},{"$f":"\"[pt]\"&E77","v":"[pt]E-Mail-Adresse:"},{"$f":"\"[gr]\"&E77","v":"[gr]E-Mail-Adresse:"}]
[{"$nulls":3},{"$f":"HLOOKUP($C$1,$E$1:$X$4910,ROW(D78))","v":"Phone Number"},"Telefonnummer:","numero di telefono:","Phone Number","Teléfono:",{"$f":"\"[fr]\"&E78","v":"[fr]Telefonnummer:"},{"$f":"\"[pt]\"&E78","v":"[pt]Telefonnummer:"},{"$f":"\"[gr]\"&E78","v":"[gr]Telefonnummer:"}]
[{"$nulls":3},{"$f":"HLOOKUP($C$1,$E$1:$X$4910,ROW(D79))","v":"Short description of Company / Organisation"},"Kurzbeschreibung\ndes Unternehmens:","Breve descrizione dell'impresa:","Short description of Company / Organisation","Breve descripción de la empresa:",{"$f":"\"[fr]\"&E79","v":"[fr]Kurzbeschreibung\ndes Unternehmens:"},{"$f":"\"[pt]\"&E79","v":"[pt]Kurzbeschreibung\ndes Unternehmens:"},{"$f":"\"[gr]\"&E79","v":"[gr]Kurzbeschreibung\ndes Unternehmens:"}]
[{"$nulls":3},{"$f":"HLOOKUP($C$1,$E$1:$X$4910,ROW(D80))","v":"Additional comments:"},"Sonstige Anmerkungen:","Altre osservazioni:","Additional comments:","Otros comentarios:",{"$f":"\"[fr]\"&E80","v":"[fr]Sonstige Anmerkungen:"},{"$f":"\"[pt]\"&E80","v":"[pt]Sonstige Anmerkungen:"},{"$f":"\"[gr]\"&E80","v":"[gr]Sonstige Anmerkungen:"}]
[{"$nulls":3},{"$f":"HLOOKUP($C$1,$E$1:$X$4910,ROW(D81))","v":"CALCULATION OF INDIVIDUAL INDICATORS"},"BERECHNUNG DER EINZELNEN THEMEN","Calcolo dei singoli criteri","CALCULATION OF INDIVIDUAL INDICATORS","CÁLCULO DE CADA UNO DE LOS TEMAS",{"$f":"\"[fr]\"&E81","v":"[fr]BERECHNUNG DER EINZELNEN THEMEN"},{"$f":"\"[pt]\"&E81","v":"[pt]BERECHNUNG DER EINZELNEN THEMEN"},{"$f":"\"[gr]\"&E81","v":"[gr]BERECHNUNG DER EINZELNEN THEMEN"}]
[{"$nulls":3},{"$f":"HLOOKUP($C$1,$E$1:$X$4910,ROW(D82))","v":"Company / Organisation"},"Unternehmen","Azienda","Company / Organisation","Empresa:",{"$f":"\"[fr]\"&E82","v":"[fr]Unternehmen"},"Empresa",{"$f":"\"[gr]\"&E82","v":"[gr]Unternehmen"}]
[{"$nulls":3},{"$f":"HLOOKUP($C$1,$E$1:$X$4910,ROW(D83))","v":"Period under review"},"Bilanz-Jahr","Anno di riferimento","Period under review","Año del balance:",{"$f":"\"[fr]\"&E83","v":"[fr]Bilanz-Jahr"},"Ano do Balançao",{"$f":"\"[gr]\"&E83","v":"[gr]Bilanz-Jahr"}]
[{"$nulls":3},{"$f":"HLOOKUP($C$1,$E$1:$X$4910,ROW(D84))","v":0}]
[{"$nulls":3},{"$f":"HLOOKUP($C$1,$E$1:$X$4910,ROW(D85))","v":0}]
[{"$nulls":3},{"$f":"HLOOKUP($C$1,$E$1:$X$4910,ROW(D86))","v":0}]
[{"$nulls":3},{"$f":"HLOOKUP($C$1,$E$1:$X$4910,ROW(D87))","v":0}]
[{"$nulls":3},{"$f":"HLOOKUP($C$1,$E$1:$X$4910,ROW(D88))","v":0}]
[{"$nulls":3},{"$f":"HLOOKUP($C$1,$E$1:$X$4910,ROW(D89))","v":0}]
[{"$nulls":3},{"$f":"HLOOKUP($C$1,$E$1:$X$4910,ROW(D90))","v":"CALCULATION OF INDIVIDUAL ASPECTS"},"BERECHNUNG DER EINZELNEN ASPEKTE","Calcolo detagliato dei singoli aspetti","CALCULATION OF INDIVIDUAL ASPECTS","CÁLCULO DE CADA UNO DE LOS ASPECTOS",{"$f":"\"[fr]\"&E90","v":"[fr]BERECHNUNG DER EINZELNEN ASPEKTE"},"CÁLCULO DETALHADO DOS ASPECTOS",{"$f":"\"[gr]\"&E90","v":"[gr]BERECHNUNG DER EINZELNEN ASPEKTE"}]
[{"$nulls":3},{"$f":"HLOOKUP($C$1,$E$1:$X$4910,ROW(D91))","v":"Common Good Balance Calculator"},"Gemeinwohl-Bilanz-Rechner","Calcolatore del bilancio del Bene Comune","Common Good Balance Calculator","Calculadora del Bien Común",{"$f":"\"[fr]\"&E91","v":"[fr]Gemeinwohl-Bilanz-Rechner"},"Tabela de Cálculo do Balançao do Bem Comum",{"$f":"\"[gr]\"&E91","v":"[gr]Gemeinwohl-Bilanz-Rechner"}]
[{"$nulls":3},{"$f":"HLOOKUP($C$1,$E$1:$X$4910,ROW(D92))","v":"Total Balance Score:"},"BILANZSUMME:","Somma Bilancio:","Total Balance Score:","Puntuación total:",{"$f":"\"[fr]\"&E92","v":"[fr]BILANZSUMME:"},"SOMA DO BALANÇO:",{"$f":"\"[gr]\"&E92","v":"[gr]BILANZSUMME:"}]
[{"$nulls":3},{"$f":"HLOOKUP($C$1,$E$1:$X$4910,ROW(D93))","v":"No."},"Nr.","N°","No.","N.º",{"$f":"\"[fr]\"&E93","v":"[fr]Nr."},{"$f":"\"[pt]\"&E93","v":"[pt]Nr."},{"$f":"\"[gr]\"&E93","v":"[gr]Nr."}]
[{"$nulls":3},{"$f":"HLOOKUP($C$1,$E$1:$X$4910,ROW(D94))","v":"Stakeholders"},"Berührungsgruppe","Gruppo coinvolto","Stakeholders ","Grupos de interés",{"$f":"\"[fr]\"&E94","v":"[fr]Berührungsgruppe"},{"$f":"\"[pt]\"&E94","v":"[pt]Berührungsgruppe"},{"$f":"\"[gr]\"&E94","v":"[gr]Berührungsgruppe"}]
[{"$nulls":3},{"$f":"HLOOKUP($C$1,$E$1:$X$4910,ROW(D95))","v":"Stakeholders/Indicators/Criteria"},"Berührungsgruppe/Themen/Aspekte","Gruppo d'Interesse/Tema/Aspetto","Stakeholders/Indicators/Criteria","Grupo de interés / Tema / Aspecto",{"$f":"\"[fr]\"&E95","v":"[fr]Berührungsgruppe/Themen/Aspekte"},{"$f":"\"[pt]\"&E95","v":"[pt]Berührungsgruppe/Themen/Aspekte"},{"$f":"\"[gr]\"&E95","v":"[gr]Berührungsgruppe/Themen/Aspekte"}]
[{"$nulls":3},{"$f":"HLOOKUP($C$1,$E$1:$X$4910,ROW(D96))","v":"Weight"},"Gewichtung","Peso","Weight","Ponderación",{"$f":"\"[fr]\"&E96","v":"[fr]Gewichtung"},"Peso",{"$f":"\"[gr]\"&E96","v":"[gr]Gewichtung"}]
[null,null,4,{"$f":"HLOOKUP($C$1,$E$1:$X$4910,ROW(D97))","v":"very high"},"sehr hoch","molto alto","very high","Muy alta",{"$f":"\"[fr]\"&E97","v":"[fr]sehr hoch"},{"$f":"\"[pt]\"&E97","v":"[pt]sehr hoch"},{"$f":"\"[gr]\"&E97","v":"[gr]sehr hoch"}]
[null,null,3,{"$f":"HLOOKUP($C$1,$E$1:$X$4910,ROW(D98))","v":"high"},"hoch","alto","high","Alta",{"$f":"\"[fr]\"&E98","v":"[fr]hoch"},{"$f":"\"[pt]\"&E98","v":"[pt]hoch"},{"$f":"\"[gr]\"&E98","v":"[gr]hoch"}]
[null,null,2,{"$f":"HLOOKUP($C$1,$E$1:$X$4910,ROW(D99))","v":"medium"},"mittel","medio","medium","Media",{"$f":"\"[fr]\"&E99","v":"[fr]mittel"},{"$f":"\"[pt]\"&E99","v":"[pt]mittel"},{"$f":"\"[gr]\"&E99","v":"[gr]mittel"}]
[null,null,1,{"$f":"HLOOKUP($C$1,$E$1:$X$4910,ROW(D100))","v":"low"},"niedrig","basso","low","Baja",{"$f":"\"[fr]\"&E100","v":"[fr]niedrig"},{"$f":"\"[pt]\"&E100","v":"[pt]niedrig"},{"$f":"\"[gr]\"&E100","v":"[gr]niedrig"}]
[null,null,0,{"$f":"HLOOKUP($C$1,$E$1:$X$4910,ROW(D101))","v":"not applicable"},"trifft nicht zu","non da considerare","not applicable","No aplica",{"$f":"\"[fr]\"&E101","v":"[fr]trifft nicht zu"},{"$f":"\"[pt]\"&E101","v":"[pt]trifft nicht zu"},{"$f":"\"[gr]\"&E101","v":"[gr]trifft nicht zu"}]
[{"$nulls":3},{"$f":"HLOOKUP($C$1,$E$1:$X$4910,ROW(D102))","v":"Current status"},"Erläuterung","Descrizione","Current status","Estado actual",{"$f":"\"[fr]\"&E102","v":"[fr]Erläuterung"},"Estado atual",{"$f":"\"[gr]\"&E102","v":"[gr]Erläuterung"}]
[{"$nulls":3},{"$f":"HLOOKUP($C$1,$E$1:$X$4910,ROW(D103))","v":"Potential for improvement"},"Verbesserungspotenzial","Possibilità di miglioramento","Potential for improvement","Áreas de mejora",{"$f":"\"[fr]\"&E103","v":"[fr]Verbesserungspotenzial"},"Potencial de aperfeiçoamento",{"$f":"\"[gr]\"&E103","v":"[gr]Verbesserungspotenzial"}]
[{"$nulls":3},{"$f":"HLOOKUP($C$1,$E$1:$X$4910,ROW(D104))","v":"Est%"},"Erfüll.","Val%","Est%","Nivel",{"$f":"\"[fr]\"&E104","v":"[fr]Erfüll."},{"$f":"\"[pt]\"&E104","v":"[pt]Erfüll."},{"$f":"\"[gr]\"&E104","v":"[gr]Erfüll."}]
[{"$nulls":3},{"$f":"HLOOKUP($C$1,$E$1:$X$4910,ROW(D105))","v":"Points"},"Pkte","Punti","Points","Punt.",{"$f":"\"[fr]\"&E105","v":"[fr]Pkte"},{"$f":"\"[pt]\"&E105","v":"[pt]Pkte"},{"$f":"\"[gr]\"&E105","v":"[gr]Pkte"}]
[{"$nulls":3},{"$f":"HLOOKUP($C$1,$E$1:$X$4910,ROW(D106))","v":"Max."},"Max.","Max.","Max.","Max.",{"$f":"\"[fr]\"&E106","v":"[fr]Max."},{"$f":"\"[pt]\"&E106","v":"[pt]Max."},{"$f":"\"[gr]\"&E106","v":"[gr]Max."}]
[{"$nulls":3},{"$f":"HLOOKUP($C$1,$E$1:$X$4910,ROW(D107))","v":"Stakeholders/ Themes/ Aspects"},"Berührungsgruppe/Themen/Aspekte","Stakeholders/ tematiche/ aspetti","Stakeholders/ Themes/ Aspects","Grupo de interés / Tema / Aspecto",{"$f":"\"[fr]\"&E107","v":"[fr]Berührungsgruppe/Themen/Aspekte"},"Grupo de interesse/Temas/Aspectos",{"$f":"\"[gr]\"&E107","v":"[gr]Berührungsgruppe/Themen/Aspekte"}]
[null,{"$f":"C108&\": \"&D108","v":"A: Suppliers"},"A",{"$f":"HLOOKUP($C$1,$E$1:$X$4910,ROW(D108))","v":"Suppliers"},"Lieferant*innen","Fornitori","Suppliers","Proveedores",{"$f":"\"[fr]\"&E108","v":"[fr]Lieferant*innen"},"FORNECEDOR*S",{"$f":"\"[gr]\"&E108","v":"[gr]Lieferant*innen"}]
[null,{"$f":"C109&\": \"&D109","v":"A1: Human dignity in the supply chain"},"A1",{"$f":"HLOOKUP($C$1,$E$1:$X$4910,ROW(D109))","v":"Human dignity in the supply chain"},"Menschenwürde in der Zulieferkette","La dignità umana lungo la catena di fornitura","Human dignity in the supply chain","Dignidad humana en la cadena de suministro",{"$f":"\"[fr]\"&E109","v":"[fr]Menschenwürde in der Zulieferkette"},"Dignidade humana na cadeia de suprimentos",{"$f":"\"[gr]\"&E109","v":"[gr]Menschenwürde in der Zulieferkette"}]
[null,null,"A1.1",{"$f":"HLOOKUP($C$1,$E$1:$X$4910,ROW(D110))","v":"Working conditions and social impact in the supply chain"},"Arbeitsbedingungen und gesellschaftliche Auswirkungen in der Zulieferkette","Condizioni di lavoro e conseguenze sociali nella catena di fornitura","Working conditions and social impact in the supply chain","Condiciones de trabajo e impacto social en la cadena de suministro",{"$f":"\"[fr]\"&E110","v":"[fr]Arbeitsbedingungen und gesellschaftliche Auswirkungen in der Zulieferkette"},"Condições de trabalho e impactos sociais na cadeia de suprimentos ",{"$f":"\"[gr]\"&E110","v":"[gr]Arbeitsbedingungen und gesellschaftliche Auswirkungen in der Zulieferkette"}]
[null,null,"A1.2",{"$f":"HLOOKUP($C$1,$E$1:$X$4910,ROW(D111))","v":"Negative aspect: violation of human dignity in the supply chain"},"Negativ-Aspekt: Verletzung der Menschenwürde in der Zulieferkette","Aspetto negativo: Violazione della dignità umana nella catena di fornitura","Negative aspect: violation of human dignity in the supply chain","Aspecto negativo: vulneración de la dignidad humana en la cadena de suministro",{"$f":"\"[fr]\"&E111","v":"[fr]Negativ-Aspekt: Verletzung der Menschenwürde in der Zulieferkette"},"Aspecto negativo: Violação da dignidade humana na cadeia de suprimentos",{"$f":"\"[gr]\"&E111","v":"[gr]Negativ-Aspekt: Verletzung der Menschenwürde in der Zulieferkette"}]
[null,{"$f":"C112&\": \"&D112","v":"A2: Solidarity and social justice in the supply chain"},"A2",{"$f":"HLOOKUP($C$1,$E$1:$X$4910,ROW(D112))","v":"Solidarity and social justice in the supply chain"},"Solidarität und Gerechtigkeit in der Zulieferkette","Solidarietà e giustizia nella catena di fornitura","Solidarity and social justice in the supply chain","Justicia y solidaridad en la cadena de suministro",{"$f":"\"[fr]\"&E112","v":"[fr]Solidarität und Gerechtigkeit in der Zulieferkette"},"Solidariedade e justiça na cadeia de suprimentos",{"$f":"\"[gr]\"&E112","v":"[gr]Solidarität und Gerechtigkeit in der Zulieferkette"}]
[null,null,"A2.1",{"$f":"HLOOKUP($C$1,$E$1:$X$4910,ROW(D113))","v":"Fair business practices towards direct suppliers"},"Faire Geschäftsbeziehungen zu direkten Lieferant*innen","Relazioni commerciali eque nei confronti dei fornitori diretti","Fair business practices towards direct suppliers","Actitud ética con proveedores directos",{"$f":"\"[fr]\"&E113","v":"[fr]Faire Geschäftsbeziehungen zu direkten Lieferant*innen"},"Relações comerciais justas com fornecedor*s diretos ",{"$f":"\"[gr]\"&E113","v":"[gr]Faire Geschäftsbeziehungen zu direkten Lieferant*innen"}]
[null,null,"A2.2",{"$f":"HLOOKUP($C$1,$E$1:$X$4910,ROW(D114))","v":"Exercising a positive influence on solidarity and social justice in the supply chain"},"Positive Einflussnahme auf Solidarität und Gerechtigkeit in der gesamten Zulieferkette","Influssi positivi sulla solidarietà e la giustizia lungo l'intera catena di fornitura","Exercising a positive influence on solidarity and social justice in the supply chain","Promoción de la justicia y la solidaridad en toda la cadena de suministro",{"$f":"\"[fr]\"&E114","v":"[fr]Positive Einflussnahme auf Solidarität und Gerechtigkeit in der gesamten Zulieferkette"},"Influência positiva relativamente a solidariedade e justiça ao longo de toda a cadeia de suprimentos",{"$f":"\"[gr]\"&E114","v":"[gr]Positive Einflussnahme auf Solidarität und Gerechtigkeit in der gesamten Zulieferkette"}]
[null,null,"A2.3",{"$f":"HLOOKUP($C$1,$E$1:$X$4910,ROW(D115))","v":"Negative aspect: abuse of market power against suppliers"},"Negativ-Aspekt: Ausnutzung der Marktmacht gegenüber Lieferant*innen","Aspetto negativo: Sfruttamento del potere di mercato nei confronti dei fornitori","Negative aspect: abuse of market power against suppliers","Aspecto negativo: abuso de poder de mercado frente a proveedores",{"$f":"\"[fr]\"&E115","v":"[fr]Negativ-Aspekt: Ausnutzung der Marktmacht gegenüber Lieferant*innen"},"Aspecto negativo: Abuso do poder de mercado face a fornecedor*s",{"$f":"\"[gr]\"&E115","v":"[gr]Negativ-Aspekt: Ausnutzung der Marktmacht gegenüber Lieferant*innen"}]
[null,{"$f":"C116&\": \"&D116","v":"A3: Environmental sustainability in the supply chain"},"A3",{"$f":"HLOOKUP($C$1,$E$1:$X$4910,ROW(D116))","v":"Environmental sustainability in the supply chain"},"Ökologische Nachhaltigkeit in der Zulieferkette","Sostenibilità ecologica nella catena di fornitura","Environmental sustainability in the supply chain","Sostenibilidad medioambiental en la cadena de suministro",{"$f":"\"[fr]\"&E116","v":"[fr]Ökologische Nachhaltigkeit in der Zulieferkette"},"Sustentabilidade ambiental na cadeia de suprimentos",{"$f":"\"[gr]\"&E116","v":"[gr]Ökologische Nachhaltigkeit in der Zulieferkette"}]
[null,null,"A3.1",{"$f":"HLOOKUP($C$1,$E$1:$X$4910,ROW(D117))","v":"Environmental impact throughout the supply chain"},"Umweltauswirkungen in der Zulieferkette","Conseguenze ambientali lungo la catena di fornitura","Environmental impact throughout the supply chain","Impacto medioambiental en la cadena de suministro",{"$f":"\"[fr]\"&E117","v":"[fr]Umweltauswirkungen in der Zulieferkette"},"Impacto ambiental na cadeia de suprimentos",{"$f":"\"[gr]\"&E117","v":"[gr]Umweltauswirkungen in der Zulieferkette"}]
[null,null,"A3.2",{"$f":"HLOOKUP($C$1,$E$1:$X$4910,ROW(D118))","v":"Negative aspect: disproportionate environmental impact throughout the supply chain"},"Negativ-Aspekt:Unverhältnismäßig hohe Umweltauswirkungen in der Zulieferkette","Aspetto negativo: Conseguenze ambientali sproporzionatamente elevate lungo la catena di fornitura","Negative aspect: disproportionate environmental impact throughout the supply chain","Aspecto negativo: impacto medioambiental desproporcionado en la cadena de suministro",{"$f":"\"[fr]\"&E118","v":"[fr]Negativ-Aspekt:Unverhältnismäßig hohe Umweltauswirkungen in der Zulieferkette"},"Aspecto negativo: Impactos ambientais proporcionalmente altos na cadeia de suprimentos",{"$f":"\"[gr]\"&E118","v":"[gr]Negativ-Aspekt:Unverhältnismäßig hohe Umweltauswirkungen in der Zulieferkette"}]
[null,{"$f":"C119&\": \"&D119","v":"A4: Transparency & co-determination in the supply chain"},"A4",{"$f":"HLOOKUP($C$1,$E$1:$X$4910,ROW(D119))","v":"Transparency & co-determination in the supply chain"},"Transparenz und Mitentscheidung in der Zulieferkette","Trasparenza e condivisione delle decisioni lungo la catena di fornitura","Transparency & co-determination in the supply chain","Transparencia y participación democrática en la cadena de suministro",{"$f":"\"[fr]\"&E119","v":"[fr]Transparenz und Mitentscheidung in der Zulieferkette"},"Transparência e co-decisão na cadeia de suprimentos",{"$f":"\"[gr]\"&E119","v":"[gr]Transparenz und Mitentscheidung in der Zulieferkette"}]
[null,null,"A4.1",{"$f":"HLOOKUP($C$1,$E$1:$X$4910,ROW(D120))","v":"Transparency towards suppliers and their right to co-determination"},"Transparenz und Mitentscheidungsrechte für Lieferant*innen","Trasparenza e diritti di condivisione delle decisioni per i fornitori","Transparency towards suppliers and their right to co-determination","Transparencia y participación democrática de los proveedores",{"$f":"\"[fr]\"&E120","v":"[fr]Transparenz und Mitentscheidungsrechte für Lieferant*innen"},"Transparência e direitos de co-decisão para fornecedor*s",{"$f":"\"[gr]\"&E120","v":"[gr]Transparenz und Mitentscheidungsrechte für Lieferant*innen"}]
[null,null,"A4.2",{"$f":"HLOOKUP($C$1,$E$1:$X$4910,ROW(D121))","v":"Positive influence on transparency and co-determination throughout the supply chain"},"Positive Einflussnahme auf Transparenz und Mitentscheidung in der gesamten Zulieferkette","Influssi positivi sulla trasparenza e la condivisione delle decisioni lungo l'intera catena di fornitura","Positive influence on transparency and co-determination throughout the supply chain","Promoción de la transparencia y participación democrática en toda la cadena de suministro",{"$f":"\"[fr]\"&E121","v":"[fr]Positive Einflussnahme auf Transparenz und Mitentscheidung in der gesamten Zulieferkette"},"Influência positiva relativamente a transparência e co-decisão ao longo de toda a cadeia de suprimentos",{"$f":"\"[gr]\"&E121","v":"[gr]Positive Einflussnahme auf Transparenz und Mitentscheidung in der gesamten Zulieferkette"}]
[null,{"$f":"C122&\": \"&D122","v":"B: Owners, equity- and financial service providers"},"B",{"$f":"HLOOKUP($C$1,$E$1:$X$4910,ROW(D122))","v":"Owners, equity- and financial service providers"},"Eigentümer*innen und Finanzpartner*innen","Proprietari & partner finanziari","Owners, equity- and financial service providers","Propietarios y proveedores financieros",{"$f":"\"[fr]\"&E122","v":"[fr]Eigentümer*innen und Finanzpartner*innen"},"PROPRIETÁRI*S & PARCEIR*S DE NEGÓCIO",{"$f":"\"[gr]\"&E122","v":"[gr]Eigentümer*innen und Finanzpartner*innen"}]
[null,{"$f":"C123&\": \"&D123","v":"B1: Ethical position in relation to financial resources"},"B1",{"$f":"HLOOKUP($C$1,$E$1:$X$4910,ROW(D123))","v":"Ethical position in relation to financial resources"},"Ethische Haltung im Umgang mit Geldmitteln","Atteggiamento etico nell'impiego di fondi","Ethical position in relation to financial resources","Actitud ética en la gestión de recursos financieros",{"$f":"\"[fr]\"&E123","v":"[fr]Ethische Haltung im Umgang mit Geldmitteln"},"Atitude ética na gestão de recursos financeiros "]
[null,null,"B1.1",{"$f":"HLOOKUP($C$1,$E$1:$X$4910,ROW(D124))","v":"Financial independence through equity financing"},"Finanzielle Unabhängigkeit durch Eigenfinanzierung","Autonomia finanziaria grazie all'autofinanziamento","Financial independence through equity financing","Independencia financiera: autofinanciación",{"$f":"\"[fr]\"&E124","v":"[fr]Finanzielle Unabhängigkeit durch Eigenfinanzierung"},"Independência financeira por meio de autofinanciamento"]
[null,null,"B1.2",{"$f":"HLOOKUP($C$1,$E$1:$X$4910,ROW(D125))","v":"Common Good-orientated borrowing"},"Gemeinwohlorientierte Fremdfinanzierung","Finanziamento esterno orientato al bene comune","Common Good-orientated borrowing","Financiación externa orientada al Bien Común",{"$f":"\"[fr]\"&E125","v":"[fr]Gemeinwohlorientierte Fremdfinanzierung"},"Financiamento externo por meio de instituições orientadas ao Bem Comum"]
[null,null,"B1.3",{"$f":"HLOOKUP($C$1,$E$1:$X$4910,ROW(D126))","v":"Ethical position of external financial partners"},"Ethische Haltung externer Finanzpartner*innen","L'approccio etico di finanziatori esterni","Ethical position of external financial partners","Actitud ética de los proveedores financieros",{"$f":"\"[fr]\"&E126","v":"[fr]Ethische Haltung externer Finanzpartner*innen"},"Atitude ética de parceir*s financeir*s extern*s "]
[null,{"$f":"C127&\": \"&D127","v":"B2: Social position in relation to financial resources"},"B2",{"$f":"HLOOKUP($C$1,$E$1:$X$4910,ROW(D127))","v":"Social position in relation to financial resources"},"Soziale Haltung im Umgang mit Geldmitteln","Atteggiamento sociale nell'impiego di fondi","Social position in relation to financial resources","Actitud solidaria en la gestión de recursos financieros",{"$f":"\"[fr]\"&E127","v":"[fr]Soziale Haltung im Umgang mit Geldmitteln"},"Atitude social na gestão de recursos financeiros "]
[null,null,"B2.1",{"$f":"HLOOKUP($C$1,$E$1:$X$4910,ROW(D128))","v":"Solidarity and Common Good-orientated use of funds"},"Solidarische und gemeinwohlorientierte Mittelverwendung","Impiego dei fondi solidale e orientato al bene comune","Solidarity and Common Good-orientated use of funds","Gestión de los recursos financieros de forma solidaria y orientada al Bien Común",{"$f":"\"[fr]\"&E128","v":"[fr]Solidarische und gemeinwohlorientierte Mittelverwendung"},"Alocação de recursos de forma solidária e orientada ao Bem Comum "]
[null,null,"B2.2",{"$f":"HLOOKUP($C$1,$E$1:$X$4910,ROW(D129))","v":"Negative aspect: unfair distribution of funds"},"Negativ-Aspekt: Unfaire Verteilung von Geldmittel","Aspetto negativo: Distribuzione iniqua di fondi","Negative aspect: unfair distribution of funds","Aspecto negativo: repartición injusta de los recursos financieros",{"$f":"\"[fr]\"&E129","v":"[fr]Negativ-Aspekt: Unfaire Verteilung von Geldmittel"},"Aspecto negativo: Distribuição injusta de recursos financeiros "]
[null,{"$f":"C130&\": \"&D130","v":"B3: Use of funds in relation to social and environmental impacts"},"B3",{"$f":"HLOOKUP($C$1,$E$1:$X$4910,ROW(D130))","v":"Use of funds in relation to social and environmental impacts"},"Sozial-ökologische Investitionen und Mittelverwendung","Investimenti socio-ecologici e impiego dei fondi","Use of funds in relation to social and environmental impacts","Inversiones financieras sostenibles y uso de los recursos financieros",{"$f":"\"[fr]\"&E130","v":"[fr]Sozial-ökologische Investitionen und Mittelverwendung"},"Investimentos e alocação de recursos com base em critérios sócio-ambientais "]
[null,null,"B3.1",{"$f":"HLOOKUP($C$1,$E$1:$X$4910,ROW(D131))","v":"Environmental quality of investments"},"Ökologische Qualität der Investitionen","Qualità ecologica degli investimenti","Environmental quality of investments","Carácter ambiental de los recursos financieros",{"$f":"\"[fr]\"&E131","v":"[fr]Ökologische Qualität der Investitionen"},"Qualidade ambiental dos investimentos "]
[null,null,"B3.2",{"$f":"HLOOKUP($C$1,$E$1:$X$4910,ROW(D132))","v":"Common Good-orientated investment"},"Gemeinwohlorientierte Veranlagung","Investimento orientato al bene comune","Common Good-orientated investment","Inversiones orientadas al Bien Común",{"$f":"\"[fr]\"&E132","v":"[fr]Gemeinwohlorientierte Veranlagung"},"Base fiscal/tributação orientada ao Bem Comum "]
[null,null,"B3.3",{"$f":"HLOOKUP($C$1,$E$1:$X$4910,ROW(D133))","v":"Negative aspect: reliance on environmentally unsafe resources"},"Negativ-Aspekt: Abhängigkeit von ökologisch bedenklichen Ressourcen","Aspetto negativo: Dipendenza da risorse a rischio in termini ecologici","Negative aspect: reliance on environmentally unsafe resources","Aspecto negativo: dependencia de recursos perjudiciales para el medio ambiente",{"$f":"\"[fr]\"&E133","v":"[fr]Negativ-Aspekt: Abhängigkeit von ökologisch bedenklichen Ressourcen"},"Aspecto negativo: Dependência de recursos ambientalmente questionáveis "]
[null,{"$f":"C134&\": \"&D134","v":"B4: Ownership and co-determination"},"B4",{"$f":"HLOOKUP($C$1,$E$1:$X$4910,ROW(D134))","v":"Ownership and co-determination"},"Eigentum und Mitentscheidung","Proprietà e condivisione delle decisioni","Ownership and co-determination","Propiedad y participación democrática",{"$f":"\"[fr]\"&E134","v":"[fr]Eigentum und Mitentscheidung"},"Propriedade e co-decisão"]
[null,null,"B4.1",{"$f":"HLOOKUP($C$1,$E$1:$X$4910,ROW(D135))","v":"Common Good-orientated ownership structure"},"Gemeinwohlorientierte Eigentumsstruktur","Struttura di proprietà orientata al bene comune","Common Good-orientated ownership structure","Distribución de la propiedad orientada al Bien Común",{"$f":"\"[fr]\"&E135","v":"[fr]Gemeinwohlorientierte Eigentumsstruktur"},"Estrutura de propriedade orientada ao Bem Comum"]
[null,null,"B4.2",{"$f":"HLOOKUP($C$1,$E$1:$X$4910,ROW(D136))","v":"Negative aspect: hostile takeover"},"Negativ-Aspekt: Feindliche Übernahme","Aspetto negativo: Scalata ostile","Negative aspect: hostile takeover","Aspecto negativo: oferta pública de adquisición (OPA) hostil",{"$f":"\"[fr]\"&E136","v":"[fr]Negativ-Aspekt: Feindliche Übernahme"},"Aspecto negativo: Aquisição hostil"]
[null,{"$f":"C137&\": \"&D137","v":"C: Employees"},"C",{"$f":"HLOOKUP($C$1,$E$1:$X$4910,ROW(D137))","v":"Employees"},"Mitarbeitende","Collaboratori","Employees","Trabajadores",{"$f":"\"[fr]\"&E137","v":"[fr]Mitarbeitende"},"COLABORADOR*S ",{"$f":"\"[gr]\"&E137","v":"[gr]Mitarbeitende"}]
[null,{"$f":"C138&\": \"&D138","v":"C1: Human dignity in the workplace and working environment"},"C1",{"$f":"HLOOKUP($C$1,$E$1:$X$4910,ROW(D138))","v":"Human dignity in the workplace and working environment"},"Menschenwürde am Arbeitsplatz","La dignità umana sul posto di lavoro","Human dignity in the workplace and working environment","Dignidad humana en el puesto de trabajo",{"$f":"\"[fr]\"&E138","v":"[fr]Menschenwürde am Arbeitsplatz"},"Dignidade humana no local de trabalho"]
[null,null,"C1.1",{"$f":"HLOOKUP($C$1,$E$1:$X$4910,ROW(D139))","v":"Employee-focused organisational culture"},"Mitarbeiterorientierte Unternehmenskultur","Cultura aziendale orientata ai collaboratori","Employee-focused organisational culture","Cultura empresarial orientada a las personas",{"$f":"\"[fr]\"&E139","v":"[fr]Mitarbeiterorientierte Unternehmenskultur"},"Cultura corporativa orientada aos/às colaborador*s"]
[null,null,"C1.2",{"$f":"HLOOKUP($C$1,$E$1:$X$4910,ROW(D140))","v":"Health promotion and occupational health and safety"},"Gesundheitsförderung und Arbeitsschutz","Promozione della salute e protezione sul posto di lavoro ","Health promotion and occupational health and safety","Promoción de la salud y seguridad en el trabajo",{"$f":"\"[fr]\"&E140","v":"[fr]Gesundheitsförderung und Arbeitsschutz"},"Promoção da saúde e da segurança ocupacional"]
[null,null,"C1.3",{"$f":"HLOOKUP($C$1,$E$1:$X$4910,ROW(D141))","v":"Diversity and equal opportunities"},"Diversität und Chancengleichheit","Diversità e pari opportunità","Diversity and equal opportunities","Diversidad e igualdad de oportunidades",{"$f":"\"[fr]\"&E141","v":"[fr]Diversität und Chancengleichheit"},"Diversidade e igualdade de oportunidades"]
[null,null,"C1.4",{"$f":"HLOOKUP($C$1,$E$1:$X$4910,ROW(D142))","v":"Negative aspect: unfit working conditions"},"Negativ-Aspekt: Menschenunwürdige Arbeitsbedingungen","Aspetto negativo: Condizioni di lavoro disumane","Negative aspect: unfit working conditions","Aspecto negativo: condiciones de trabajo indignas",{"$f":"\"[fr]\"&E142","v":"[fr]Negativ-Aspekt: Menschenunwürdige Arbeitsbedingungen"},"Aspecto negativo: Condições de trabalho que ferem a dignidade humana "]
[null,{"$f":"C143&\": \"&D143","v":"C2: Self-determined working arrangements"},"C2",{"$f":"HLOOKUP($C$1,$E$1:$X$4910,ROW(D143))","v":"Self-determined working arrangements"},"Ausgestaltung der Arbeitsverträge","Welfare aziendale, retribuzione e organizzazione del lavoro","Self-determined working arrangements","Formalidad de los contratos de trabajo",{"$f":"\"[fr]\"&E143","v":"[fr]Ausgestaltung der Arbeitsverträge"},"Configuração dos contratos de trabalho"]
[null,null,"C2.1",{"$f":"HLOOKUP($C$1,$E$1:$X$4910,ROW(D144))","v":"Pay structure"},"Ausgestaltung des Verdienstes","Strutturazione del guadagno","Pay structure","Formalidad y estructura salarial",{"$f":"\"[fr]\"&E144","v":"[fr]Ausgestaltung des Verdienstes"},"Configuração da remuneração "]
[null,null,"C2.2",{"$f":"HLOOKUP($C$1,$E$1:$X$4910,ROW(D145))","v":"Structuring working time"},"Ausgestaltung der Arbeitszeit","Organizzazione dell'orario di lavoro","Structuring working time","Formalidad en el horario laboral",{"$f":"\"[fr]\"&E145","v":"[fr]Ausgestaltung der Arbeitszeit"},"Configuração do horário de trabalho"]
[null,null,"C2.3",{"$f":"HLOOKUP($C$1,$E$1:$X$4910,ROW(D146))","v":"Employment structure and work-life balance"},"Ausgestaltung des Arbeitsverhältnisses und Work-Life-Balance","Organizzazione del rapporto di lavoro e Work-Life-Balance","Employment structure and work-life balance","Formalidad en las condiciones de trabajo y en la conciliación",{"$f":"\"[fr]\"&E146","v":"[fr]Ausgestaltung des Arbeitsverhältnisses und Work-Life-Balance"},"Configuração das condições de trabalho, equilíbrio entre vida profissional e familiar"]
[null,null,"C2.4",{"$f":"HLOOKUP($C$1,$E$1:$X$4910,ROW(D147))","v":"Negative aspect: unfair employment contracts"},"Negativ-Aspekt: Ungerechte Ausgestaltung der Arbeitsverträge","Aspetto negativo: Strutturazione ingiusta dei contratti di lavoro","Negative aspect: unfair employment contracts","Aspecto negativo: contratos de trabajo injustos",{"$f":"\"[fr]\"&E147","v":"[fr]Negativ-Aspekt: Ungerechte Ausgestaltung der Arbeitsverträge"},"Aspecto negativo: Configuração injusta dos contratos de trabalho "]
[null,{"$f":"C148&\": \"&D148","v":"C3: Environmentally-friendly behaviour of staff"},"C3",{"$f":"HLOOKUP($C$1,$E$1:$X$4910,ROW(D148))","v":"Environmentally-friendly behaviour of staff"},"Förderung des ökologischen Verhaltens der Mitarbeitenden","Promozione del comportamento ecologico dei collaboratori","Environmentally-friendly behaviour of staff","Promoción de la responsabilidad medioambiental de los trabajadores",{"$f":"\"[fr]\"&E148","v":"[fr]Förderung des ökologischen Verhaltens der Mitarbeitenden"},"Promoção de condutas sustentáveis entre colaborador*s"]
[null,null,"C3.1",{"$f":"HLOOKUP($C$1,$E$1:$X$4910,ROW(D149))","v":"Food during working hours"},"Ernährung während der Arbeitszeit","L'alimentazione durante l'orario di lavoro","Food during working hours","Alimentación durante la jornada laboral",{"$f":"\"[fr]\"&E149","v":"[fr]Ernährung während der Arbeitszeit"},"Alimentação durante o horário de trabalho "]
[null,null,"C3.2",{"$f":"HLOOKUP($C$1,$E$1:$X$4910,ROW(D150))","v":"Travel to work"},"Mobilität zum Arbeitsplatz","Mobilità sul posto di lavoro","Travel to work","Movilidad sostenible al puesto de trabajo",{"$f":"\"[fr]\"&E150","v":"[fr]Mobilität zum Arbeitsplatz"},"Mobilidade para o local de trabalho"]
[null,null,"C3.3",{"$f":"HLOOKUP($C$1,$E$1:$X$4910,ROW(D151))","v":"Organisational culture, cultivating awareness for an environmentally-friendly approach"},"Organisationskultur, Sensibilisierung und unternehmensinterne Prozesse","Cultura organizzativa, sensibilizzazione all'organizzazione ecologica dei processi","Organisational culture, cultivating awareness for an environmentally-friendly approach","Cultura empresarial sostenible y sensibilización con el medio ambiente",{"$f":"\"[fr]\"&E151","v":"[fr]Organisationskultur, Sensibilisierung und unternehmensinterne Prozesse"},"Cultura organizacional, sensibilização e processos internos da empresa "]
[null,null,"C3.4",{"$f":"HLOOKUP($C$1,$E$1:$X$4910,ROW(D152))","v":"Negative aspect: guidance on waste/ environmentally damaging practices"},"Negativ-Aspekt: Anleitung zur Verschwendung / Duldung unökologischen Verhaltens","Aspetto negativo: Guida allo spreco / Tolleranza di comportamenti non ecologici","Negative aspect: guidance on waste/ environmentally damaging practices","Aspecto negativo: promoción y tolerancia frente a la actitud medioambiental no responsable",{"$f":"\"[fr]\"&E152","v":"[fr]Negativ-Aspekt: Anleitung zur Verschwendung / Duldung unökologischen Verhaltens"},"Aspecto negativo: Orientação ao desperdício / tolerância de condutas ecologicamente nocivas "]
[null,{"$f":"C153&\": \"&D153","v":"C4: Co-determination and transparency within the organisation"},"C4",{"$f":"HLOOKUP($C$1,$E$1:$X$4910,ROW(D153))","v":"Co-determination and transparency within the organisation"},{"$f":"\"Innerbetriebliche Mitentscheidung und Transparenz\"","v":"Innerbetriebliche Mitentscheidung und Transparenz"},"Condivisione delle decisioni e trasparenza in azienda","Co-determination and transparency within the organisation","Transparencia y participación democrática interna",{"$f":"\"[fr]\"&E153","v":"[fr]Innerbetriebliche Mitentscheidung und Transparenz"},"Co-decisão e transparência no âmbito da empresa"]
[null,null,"C4.1",{"$f":"HLOOKUP($C$1,$E$1:$X$4910,ROW(D154))","v":"Transparency within the organisation"},"Innerbetriebliche Transparenz","Trasparenza in azienda","Transparency within the organisation","Transparencia interna",{"$f":"\"[fr]\"&E154","v":"[fr]Innerbetriebliche Transparenz"},"Transparência interna"]
[null,null,"C4.2",{"$f":"HLOOKUP($C$1,$E$1:$X$4910,ROW(D155))","v":"Legitimation of the management"},"Legitimierung der Führungskräfte","Legittimazione dei dirigenti","Legitimation of the management","Legitimación de la dirección",{"$f":"\"[fr]\"&E155","v":"[fr]Legitimierung der Führungskräfte"},"Legitimação dos líderes"]
[null,null,"C4.3",{"$f":"HLOOKUP($C$1,$E$1:$X$4910,ROW(D156))","v":"Employee co-determination"},"Mitentscheidung der Mitarbeitenden","Condivisione delle decisioni da parte dei collaboratori","Employee co-determination","Participación de los trabajadores en la toma de decisiones",{"$f":"\"[fr]\"&E156","v":"[fr]Mitentscheidung der Mitarbeitenden"},"Co-decisão por parte d*s colaborador*s "]
[null,null,"C4.4",{"$f":"HLOOKUP($C$1,$E$1:$X$4910,ROW(D157))","v":"Negative aspect: obstruction of works councils"},"Negativ-Aspekt C4.4: Verhinderung des Betriebsrates","Aspetto negativo: Impedimento del consiglio aziendale","Negative aspect: obstruction of works councils","Aspecto negativo: Impedimiento del comité de empresa",{"$f":"\"[fr]\"&E157","v":"[fr]Negativ-Aspekt C4.4: Verhinderung des Betriebsrates"},"Aspecto negativo: Impedimento da formação de Comités de Empresa"]
[null,{"$f":"C158&\": \"&D158","v":"D: Customers and other companies"},"D",{"$f":"HLOOKUP($C$1,$E$1:$X$4910,ROW(D158))","v":"Customers and other companies"},"Kund*nnen und Mitunternehmen","Clienti & concorrenti","Customers and other companies","Clientes y otras empresas",{"$f":"\"[fr]\"&E158","v":"[fr]Kund*nnen und Mitunternehmen"},"CLIENTES & PARCEIR*S DE NEGÓCIO ",{"$f":"\"[gr]\"&E158","v":"[gr]Kund*nnen und Mitunternehmen"}]
[null,{"$f":"C159&\": \"&D159","v":"D1: Ethical customer relations"},"D1",{"$f":"HLOOKUP($C$1,$E$1:$X$4910,ROW(D159))","v":"Ethical customer relations"},"Ethische Kund*innenbeziehungen","Relazioni etiche con la clientela","Ethical customer relations","Actitud ética con los clientes","con la clientela","Relações éticas com clientes"]
[null,null,"D1.1",{"$f":"HLOOKUP($C$1,$E$1:$X$4910,ROW(D160))","v":"Respect for human dignity in communication with customers"},"Menschenwürdige Kommunikation mit Kund*innen","Comunicazione dignitosa con i clienti","Respect for human dignity in communication with customers","Comunicación transparente con los clientes",{"$f":"\"[fr]\"&E160","v":"[fr]Menschenwürdige Kommunikation mit Kund*innen"},"Comunicação com clientes de forma digna"]
[null,null,"D1.2",{"$f":"HLOOKUP($C$1,$E$1:$X$4910,ROW(D161))","v":"Barrier-free access"},"Barrierefreiheit","Assenza di barriere","Barrier-free access","Accesibilidad",{"$f":"\"[fr]\"&E161","v":"[fr]Barrierefreiheit"},"Acessibilidade "]
[null,null,"D1.3",{"$f":"HLOOKUP($C$1,$E$1:$X$4910,ROW(D162))","v":"Negative aspect: unethical advertising"},"Negativ-Aspekt: Unethische Werbemaßnahmen","Aspetto negativo: Misure pubblicitarie non etiche","Negative aspect: unethical advertising","Aspecto negativo: publicidad engañosa y acciones comerciales no éticas",{"$f":"\"[fr]\"&E162","v":"[fr]Negativ-Aspekt: Unethische Werbemaßnahmen"},"Aspecto negativo: Atividades promocionais antiéticas "]
[null,{"$f":"C163&\": \"&D163","v":"D2: Cooperation and solidarity with other companies"},"D2",{"$f":"HLOOKUP($C$1,$E$1:$X$4910,ROW(D163))","v":"Cooperation and solidarity with other companies"},"Kooperation und Solidarität mit Mitunternehmen","Cooperazione e solidarietà con i concorrenti","Cooperation and solidarity with other companies","Cooperación y solidaridad con otras empresas del sector",{"$f":"\"[fr]\"&E163","v":"[fr]Kooperation und Solidarität mit Mitunternehmen"},"Cooperação e solidariedade com parceir*s de negócio"]
[null,null,"D2.1",{"$f":"HLOOKUP($C$1,$E$1:$X$4910,ROW(D164))","v":"Cooperation with other companies"},"Kooperation mit Mitunternehmen","Cooperazione con i concorrenti","Cooperation with other companies","Cooperación con otras empresas",{"$f":"\"[fr]\"&E164","v":"[fr]Kooperation mit Mitunternehmen"},"Cooperação com parceir*s de negócio"]
[null,null,"D2.2",{"$f":"HLOOKUP($C$1,$E$1:$X$4910,ROW(D165))","v":"Solidarity with other companies"},"Solidarität mit Mitunternehmen","La solidarietà con i concorrenti","Solidarity with other companies","Solidaridad con otras empresas",{"$f":"\"[fr]\"&E165","v":"[fr]Solidarität mit Mitunternehmen"},"Solidariedade com parceir*s de negócio"]
[null,null,"D2.3",{"$f":"HLOOKUP($C$1,$E$1:$X$4910,ROW(D166))","v":"Negative aspect: abuse of market power to the detriment of other companies"},"Negativ-Aspekt D2.3: Missbrauch der Marktmacht gegenüber Mitunternehmen","Aspetto negativo: Abuso del potere di mercato nei confronti dei concorrenti","Negative aspect: abuse of market power to the detriment of other companies","Aspecto negativo: abuso de poder de mercado frente a otras empresas",{"$f":"\"[fr]\"&E166","v":"[fr]Negativ-Aspekt D2.3: Missbrauch der Marktmacht gegenüber Mitunternehmen"},"Aspecto negativo: Abuso do poder de mercado face a parceir*s de negócio"]
[null,{"$f":"C167&\": \"&D167","v":"D3: Impact on the environment of the use and disposal of products and services"},"D3",{"$f":"HLOOKUP($C$1,$E$1:$X$4910,ROW(D167))","v":"Impact on the environment of the use and disposal of products and services"},"Ökologische Auswirkung durch Nutzung und Entsorgung von Produkten und Dienstleistungen","Conseguenze ecologiche dell'utilizzo e dello smaltimento di prodotti e servizi","Impact on the environment of the use and disposal of products and services","Impacto medioambiental del uso y de la gestión de residuos de los productos y servicios",{"$f":"\"[fr]\"&E167","v":"[fr]Ökologische Auswirkung durch Nutzung und Entsorgung von Produkten und Dienstleistungen"},"Impacto ambiental do uso e do descarte de produtos e serviços"]
[null,null,"D3.1",{"$f":"HLOOKUP($C$1,$E$1:$X$4910,ROW(D168))","v":"Environmental cost-benefit ration of products and services (efficiency and consistency)"},"Ökologisches Kosten-Nutzen-Verhältnis von Produkten und Dienstleistungen (Effizienz und Konsistenz)","Rapporto ecologico costi/ benefici di prodotti e servizi (efficienza e consistenza)","Environmental cost-benefit ration of products and services (efficiency and consistency) ","Relación coste-beneficio medioambiental de productos y ervicios (eficiencia y consistencia)",{"$f":"\"[fr]\"&E168","v":"[fr]Ökologisches Kosten-Nutzen-Verhältnis von Produkten und Dienstleistungen (Effizienz und Konsistenz)"},"Relação custo-benefício em termos ambientais de produtos e serviços (eficiência e consistência)"]
[null,null,"D3.2",{"$f":"HLOOKUP($C$1,$E$1:$X$4910,ROW(D169))","v":"Moderate use of products and services (sufficiency)"},"Maßvolle Nutzung von Produkten und Dienstleistungen (Suffizienz)","Utilizzo moderato di prodotti e servizi (sufficienza)","Moderate use of products and services (sufficiency)","Uso moderado de productos y servicios (suficiencia)",{"$f":"\"[fr]\"&E169","v":"[fr]Maßvolle Nutzung von Produkten und Dienstleistungen (Suffizienz)"},"Utilização moderada de produtos e serviços (suficiência)"]
[null,null,"D3.3",{"$f":"HLOOKUP($C$1,$E$1:$X$4910,ROW(D170))","v":"Negative aspect: wilful disregard of disproportionate environmental impacts"},"Negativ-Aspekt: Bewusste Inkaufnahme unverhältnismäßiger, ökologischer Auswirkungen","Aspetto negativo: Accettazione consapevole di conseguenze ecologiche spropositate","Negative aspect: wilful disregard of disproportionate environmental impacts","Aspecto negativo: tolerancia frente al impacto medioambiental desproporcionado y consciente",{"$f":"\"[fr]\"&E170","v":"[fr]Negativ-Aspekt: Bewusste Inkaufnahme unverhältnismäßiger, ökologischer Auswirkungen"},"Aspecto negativo: Tolerância consciente de impactos ambientais excessivos "]
[null,{"$f":"C171&\": \"&D171","v":"D4: Customer participation and product transparency"},"D4",{"$f":"HLOOKUP($C$1,$E$1:$X$4910,ROW(D171))","v":"Customer participation and product transparency"},"Kund*innen-Mitwirkung und Produkttransparenz","Partecipazione dei clienti e trasparenza dei prodotti","Customer participation and product transparency","Participación de los clientes y transparencia de producto",{"$f":"\"[fr]\"&E171","v":"[fr]Kund*innen-Mitwirkung und Produkttransparenz"},"Envolvimento de clientes e transparência de produtos"]
[null,null,"D4.1",{"$f":"HLOOKUP($C$1,$E$1:$X$4910,ROW(D172))","v":"Customer participation, joint product development and market research"},"Kund*innen-Mitwirkung, gemeinsame Produktentwicklung und Marktforschung","Partecipazione dei clienti, sviluppo comune dei prodotti e ricerca di mercato","Customer participation, joint product development and market research","Participación de los clientes en la toma de decisiones, desarrollo de producto e investigación de mercado",{"$f":"\"[fr]\"&E172","v":"[fr]Kund*innen-Mitwirkung, gemeinsame Produktentwicklung und Marktforschung"},"Envolvimento de clientes, desenvolvimento de produtos e pesquisa de mercado em parceria"]
[null,null,"D4.2",{"$f":"HLOOKUP($C$1,$E$1:$X$4910,ROW(D173))","v":"Product transparency"},"Produkttransparenz","Trasparenza dei prodotti","Product transparency","Transparencia de producto",{"$f":"\"[fr]\"&E173","v":"[fr]Produkttransparenz"},"Transparência de produtos"]
[null,null,"D4.2",{"$f":"HLOOKUP($C$1,$E$1:$X$4910,ROW(D174))","v":"Negative aspect: non-disclosure of hazardous substances"},"Negativ-Aspekt: Kein Ausweis von Gefahrenstoffen","Aspetto negativo: Mancata indicazione di sostanze pericolose","Negative aspect: non-disclosure of hazardous substances","Aspecto negativo: no declaración sobre sustancias/mercancías peligrosas",{"$f":"\"[fr]\"&E174","v":"[fr]Negativ-Aspekt: Kein Ausweis von Gefahrenstoffen"},"Aspecto negativo: Não-declaração de substâncias perigosas"]
[null,{"$f":"C175&\": \"&D175","v":"E: Social environment"},"E",{"$f":"HLOOKUP($C$1,$E$1:$X$4910,ROW(D175))","v":"Social environment"},"Gesellschaftliches Umfeld","Contesto sociale","Social environment","Entorno social",{"$f":"\"[fr]\"&E175","v":"[fr]Gesellschaftliches Umfeld"},"MEIO SOCIAL ",{"$f":"\"[gr]\"&E175","v":"[gr]Gesellschaftliches Umfeld"}]
[null,{"$f":"C176&\": \"&D176","v":"E1: Purpose of products and services and their effects on society"},"E1",{"$f":"HLOOKUP($C$1,$E$1:$X$4910,ROW(D176))","v":"Purpose of products and services and their effects on society"},"Sinn und gesellschaftliche Wirkung der Produkte und Dienstleistungen","Senso e impatto dei prodotti e servizi sulla società","Purpose of products and services and their effects on society","Propósito e impacto positivo de los productos y servicios",{"$f":"\"[fr]\"&E176","v":"[fr]Sinn und gesellschaftliche Wirkung der Produkte und Dienstleistungen"},"Sentido e impacto social dos produtos e serviços"]
[null,null,"E1.1",{"$f":"HLOOKUP($C$1,$E$1:$X$4910,ROW(D177))","v":"Products and services should cover basic needs and contribute to a good life"},"Produkte und Dienstleistungen decken den Grundbedarf und dienen dem guten Leben","Prodotti e servizi coprono il fabbisogno di base e sono utili a una buona vita","Products and services should cover basic needs and contribute to a good life","Productos y servicios que cubren las necesidades básicas y mejoran la calidad de vida",{"$f":"\"[fr]\"&E177","v":"[fr]Produkte und Dienstleistungen decken den Grundbedarf und dienen dem guten Leben"},"Produtos e serviços respondem às necessidades básicas e fomentam o bem-estar"]
[null,null,"E1.2",{"$f":"HLOOKUP($C$1,$E$1:$X$4910,ROW(D178))","v":"Social impact of products and services"},"Gesellschaftliche Wirkung der Produkte und Dienstleistungen","Impatto dei prodotti e servizi sulla società","Social impact of products and services","Impacto social de los productos y servicios",{"$f":"\"[fr]\"&E178","v":"[fr]Gesellschaftliche Wirkung der Produkte und Dienstleistungen"},"Impacto social dos produtos e serviços"]
[null,null,"E1.3",{"$f":"HLOOKUP($C$1,$E$1:$X$4910,ROW(D179))","v":"Negative aspect: unethical and unfit products and services"},"Negativ-Aspekt: Menschenunwürdige Produkte und Dienstleistungen","Aspetto negativo: Prodotti e servizi disumani","Negative aspect: unethical and unfit products and services","Aspecto negativo: productos y servicios que vulneran la dignidad humana",{"$f":"\"[fr]\"&E179","v":"[fr]Negativ-Aspekt: Menschenunwürdige Produkte und Dienstleistungen"},"Aspecto negativo: Produtos e serviços que ferem a dignidade humana "]
[null,{"$f":"C180&\": \"&D180","v":"E2: Contribution to the community"},"E2",{"$f":"HLOOKUP($C$1,$E$1:$X$4910,ROW(D180))","v":"Contribution to the community"},"Beitrag zum Gemeinwesen","Contributo per la collettività","Contribution to the community","Contribución a la comunidad",{"$f":"\"[fr]\"&E180","v":"[fr]Beitrag zum Gemeinwesen"},"Contribuição para a comunidade"]
[null,null,"E2.1",{"$f":"HLOOKUP($C$1,$E$1:$X$4910,ROW(D181))","v":"Taxes and social security contributions"},"Steuern und Sozialabgaben","Imposte e oneri sociali","Taxes and social security contributions","Impuestos y prestaciones sociales",{"$f":"\"[fr]\"&E181","v":"[fr]Steuern und Sozialabgaben"},"Impostos e encargos sociais "]
[null,null,"E2.2",{"$f":"HLOOKUP($C$1,$E$1:$X$4910,ROW(D182))","v":"Voluntary contributions that strengthen society"},"Freiwillige Beiträge zur Stärkung des Gemeinwesens","Contributi volontari per rafforzare la collettività","Voluntary contributions that strengthen society","Contribución voluntaria a la comunidad",{"$f":"\"[fr]\"&E182","v":"[fr]Freiwillige Beiträge zur Stärkung des Gemeinwesens"},"Contribuição voluntária para o fortalecimento da comunidade"]
[null,null,"E2.3",{"$f":"HLOOKUP($C$1,$E$1:$X$4910,ROW(D183))","v":"Negative aspect: inappropriate non-payment of tax"},"Negativ-Aspekt: Illegitime Steuervermeidung","Aspetto negativo: Evasione fiscale illecita","Negative aspect: inappropriate non-payment of tax","Aspecto negativo: elusión y evasión fiscal",{"$f":"\"[fr]\"&E183","v":"[fr]Negativ-Aspekt: Illegitime Steuervermeidung"},"Aspecto negativo: Evasão fiscal "]
[null,null,"E2.4",{"$f":"HLOOKUP($C$1,$E$1:$X$4910,ROW(D184))","v":"Negative aspect: no anti-corruption policy"},"Negativ-Aspekt: Mangelnde Korruptionsprävention","Aspetto negativo: Mancata prevenzione della corruzione","Negative aspect: no anti-corruption policy","Aspecto negativo: falta de prevención frente a la corrupción",{"$f":"\"[fr]\"&E184","v":"[fr]Negativ-Aspekt: Mangelnde Korruptionsprävention"},"Aspecto negativo: Medidas insufucientes de prevenção da corrupção"]
[null,{"$f":"C185&\": \"&D185","v":"E3: Reduction of environmental impact"},"E3",{"$f":"HLOOKUP($C$1,$E$1:$X$4910,ROW(D185))","v":"Reduction of environmental impact"},"Reduktion ökologischer Auswirkungen","Riduzione delle conseguenze ecologiche","Reduction of environmental impact","Reducción del impacto medioambiental",{"$f":"\"[fr]\"&E185","v":"[fr]Reduktion ökologischer Auswirkungen"},"Redução de impactos ambientais "]
[null,null,"E3.1",{"$f":"HLOOKUP($C$1,$E$1:$X$4910,ROW(D186))","v":"Absolute impact and management strategy"},"Absolute Auswirkungen / Management & Strategie","Conseguenze assolute / Management & strategia","Absolute impact and management strategy","Impacto medioambiental / Gestión y estrategia",{"$f":"\"[fr]\"&E186","v":"[fr]Absolute Auswirkungen / Management & Strategie"},"Impactos absolutos / Gestão & Estratégia"]
[null,null,"E3.2",{"$f":"HLOOKUP($C$1,$E$1:$X$4910,ROW(D187))","v":"Relative impact"},"Relative Auswirkungen","Conseguenze relative","Relative impact","Impacto relativo",{"$f":"\"[fr]\"&E187","v":"[fr]Relative Auswirkungen"},"Impactos relativos"]
[null,null,"E3.3",{"$f":"HLOOKUP($C$1,$E$1:$X$4910,ROW(D188))","v":"Negative aspect: infringement of environmental regulations and disproportionate environmental pollution"},"Negativ-Aspekt: Verstöße gegen Umweltauflagen sowie unangemessene Umweltbelastungen","Aspetto negativo: Violazioni dei requisiti ambientali e impatto inadeguato sull'ambiente","Negative aspect: infringement of environmental regulations and disproportionate environmental pollution","Aspecto negativo: infracción de la normativa medioambiental e impacto desproporcionado",{"$f":"\"[fr]\"&E188","v":"[fr]Negativ-Aspekt: Verstöße gegen Umweltauflagen sowie unangemessene Umweltbelastungen"},"Aspecto negativo: Violação de exigências ambientais, bem como elevados impactos ambientais "]
[null,{"$f":"C189&\": \"&D189","v":"E4: Social co-determination and transparency"},"E4",{"$f":"HLOOKUP($C$1,$E$1:$X$4910,ROW(D189))","v":"Social co-determination and transparency"},"Transparenz und gesellschaftliche Mitentscheidung","Trasparenza e condivisione sociale delle decisioni","Social co-determination and transparency","Transparencia y participación democrática del entorno social",{"$f":"\"[fr]\"&E189","v":"[fr]Transparenz und gesellschaftliche Mitentscheidung"},"Transparência e participação social na tomada de decisões "]
[null,null,"E4.1",{"$f":"HLOOKUP($C$1,$E$1:$X$4910,ROW(D190))","v":"Transparency"},"Transparenz","Trasparenza","Transparency","Transparencia",{"$f":"\"[fr]\"&E190","v":"[fr]Transparenz"},"Transparência"]
[null,null,"E4.2",{"$f":"HLOOKUP($C$1,$E$1:$X$4910,ROW(D191))","v":"Social participation"},"Gesellschaftliche Mitbestimmung","Condivisione sociale delle decisioni","Social participation","Participación en la toma de decisiones el entorno social",{"$f":"\"[fr]\"&E191","v":"[fr]Gesellschaftliche Mitbestimmung"},"Participação social na tomada de decisões"]
[null,null,"E4.3",{"$f":"HLOOKUP($C$1,$E$1:$X$4910,ROW(D192))","v":"Negative aspect: lack of transparency and wilful misinformation"},"Negativ-Aspekt: Förderung von Intransparenz und bewusste Fehlinformation","Aspetto negativo: Promozione di poca trasparenza e informazioni consapevolmente errate","Negative aspect: lack of transparency and wilful misinformation","Aspecto negativo: manipulación de la información y falta de transparencia",{"$f":"\"[fr]\"&E192","v":"[fr]Negativ-Aspekt: Förderung von Intransparenz und bewusste Fehlinformation"},"Aspecto negativo: Promoção de intransparência e propagação de informação enganosa"]
[{"$nulls":3},{"$f":"HLOOKUP($C$1,$E$1:$X$4910,ROW(D193))","v":0}]
[{"$nulls":3},{"$f":"HLOOKUP($C$1,$E$1:$X$4910,ROW(D194))","v":"Company details"},"Fakten zum Unternehmen","Fatti sull’azienda","Company details","Datos de la empresa",{"$f":"\"[fr]\"&E194","v":"[fr]Fakten zum Unternehmen"},{"$f":"\"[pt]\"&E194","v":"[pt]Fakten zum Unternehmen"},{"$f":"\"[gr]\"&E194","v":"[gr]Fakten zum Unternehmen"}]
[{"$nulls":3},{"$f":"HLOOKUP($C$1,$E$1:$X$4910,ROW(D195))","v":"Fill in the highlighted fields below. Where detailed information is not available, please enter estimates, otherwise the calculation will not be accurate"},"Bitte füllen Sie die farblich markierten Felder mit Daten für den Bilanzierungszeitraum, meist das Geschäftsjahr, aus. Falls der Bilanzierungszeitraum länger als 1 Jahr ist können Sie auch ein Geschäftsjahr aus dem Bilanzierungszeitraum auswählen. Sollten dennoch keine konkreten Daten vorliegen bitte um grobe Schätzungen, da die Berechnung sonst fehlerhaft ist. ","Si prega di compilare i campi con codice colore con i dati per il periodo contabile, di solito l'anno fiscale. Se il periodo contabile supera 1 anno, è anche possibile selezionare un anno fiscale dal periodo contabile. Se non ci sono dati concreti, si prega di fornire stime approssimative, altrimenti il ​​calcolo sarà errato.","Fill in the highlighted fields below. Where detailed information is not available, please enter estimates, otherwise the calculation will not be accurate","Rellene los campos marcados con color. Si no dispusiera de algunos datos en concreto, estime su valor. Los datos son necesarios para que la hoja de cálculo funcione correctamente.",{"$f":"\"[fr]\"&E195","v":"[fr]Bitte füllen Sie die farblich markierten Felder mit Daten für den Bilanzierungszeitraum, meist das Geschäftsjahr, aus. Falls der Bilanzierungszeitraum länger als 1 Jahr ist können Sie auch ein Geschäftsjahr aus dem Bilanzierungszeitraum auswählen. Sollten dennoch keine konkreten Daten vorliegen bitte um grobe Schätzungen, da die Berechnung sonst fehlerhaft ist."},{"$f":"\"[pt]\"&E195","v":"[pt]Bitte füllen Sie die farblich markierten Felder mit Daten für den Bilanzierungszeitraum, meist das Geschäftsjahr, aus. Falls der Bilanzierungszeitraum länger als 1 Jahr ist können Sie auch ein Geschäftsjahr aus dem Bilanzierungszeitraum auswählen. Sollten dennoch keine konkreten Daten vorliegen bitte um grobe Schätzungen, da die Berechnung sonst fehlerhaft ist."},{"$f":"\"[gr]\"&E195","v":"[gr]Bitte füllen Sie die farblich markierten Felder mit Daten für den Bilanzierungszeitraum, meist das Geschäftsjahr, aus. Falls der Bilanzierungszeitraum länger als 1 Jahr ist können Sie auch ein Geschäftsjahr aus dem Bilanzierungszeitraum auswählen. Sollten dennoch keine konkreten Daten vorliegen bitte um grobe Schätzungen, da die Berechnung sonst fehlerhaft ist."}]
[{"$nulls":3},{"$f":"HLOOKUP($C$1,$E$1:$X$4910,ROW(D196))","v":0}]
[{"$nulls":3},{"$f":"HLOOKUP($C$1,$E$1:$X$4910,ROW(D197))","v":0}]
[{"$nulls":3},{"$f":"HLOOKUP($C$1,$E$1:$X$4910,ROW(D198))","v":0}]
[{"$nulls":3},{"$f":"HLOOKUP($C$1,$E$1:$X$4910,ROW(D199))","v":0}]
[{"$nulls":3},{"$f":"HLOOKUP($C$1,$E$1:$X$4910,ROW(D200))","v":0}]
[{"$nulls":3},{"$f":"HLOOKUP($C$1,$E$1:$X$4910,ROW(D201))","v":0}]
[{"$nulls":3},{"$f":"HLOOKUP($C$1,$E$1:$X$4910,ROW(D202))","v":"Please enter"},"bitte einfügen","Inserisca per favore","Please enter","Escriba",{"$f":"\"[fr]\"&E202","v":"[fr]bitte einfügen"},{"$f":"\"[pt]\"&E202","v":"[pt]bitte einfügen"},{"$f":"\"[gr]\"&E202","v":"[gr]bitte einfügen"}]
[{"$nulls":3},{"$f":"HLOOKUP($C$1,$E$1:$X$4910,ROW(D203))","v":"Please choose"},"Bitte Auswählen","Selezioni per favore","Please choose","Seleccione del catálogo",{"$f":"\"[fr]\"&E203","v":"[fr]Bitte Auswählen"},{"$f":"\"[pt]\"&E203","v":"[pt]Bitte Auswählen"},{"$f":"\"[gr]\"&E203","v":"[gr]Bitte Auswählen"}]
[{"$nulls":3},{"$f":"HLOOKUP($C$1,$E$1:$X$4910,ROW(D204))","v":"Description of the weighting model"},"Beschreibung des Gewichtungsmodelles","Descrizione del modello di pesatura","Description of the weighting model","Descripción del método de ponderación",{"$f":"\"[fr]\"&E204","v":"[fr]Beschreibung des Gewichtungsmodelles"},{"$f":"\"[pt]\"&E204","v":"[pt]Beschreibung des Gewichtungsmodelles"},{"$f":"\"[gr]\"&E204","v":"[gr]Beschreibung des Gewichtungsmodelles"}]
[{"$nulls":3},{"$f":"HLOOKUP($C$1,$E$1:$X$4910,ROW(D205))","v":"Themes"},"Themen","Temi","Themes","Temas",{"$f":"\"[fr]\"&E205","v":"[fr]Themen"},{"$f":"\"[pt]\"&E205","v":"[pt]Themen"},{"$f":"\"[gr]\"&E205","v":"[gr]Themen"}]
[{"$nulls":3},{"$f":"HLOOKUP($C$1,$E$1:$X$4910,ROW(D206))","v":"Values ►\nStakekolders ▼"},"Werte ►\nBerührungsgruppe ▼","Valori ►\nGruppi d‘interesse ▼","Values ►\nStakekolders ▼","Valores ►\nGrupos deinterés ▼",{"$f":"\"[fr]\"&E206","v":"[fr]Werte ►\nBerührungsgruppe ▼"},{"$f":"\"[pt]\"&E206","v":"[pt]Werte ►\nBerührungsgruppe ▼"},{"$f":"\"[gr]\"&E206","v":"[gr]Werte ►\nBerührungsgruppe ▼"}]
[{"$nulls":3},{"$f":"HLOOKUP($C$1,$E$1:$X$4910,ROW(D207))","v":"Stakekolders & values"},"Berührungsgruppen & Werte","Gruppi d‘interesse & valori","Stakekolders & values","Grupos de interés ▼",{"$f":"\"[fr]\"&E207","v":"[fr]Berührungsgruppen & Werte"},{"$f":"\"[pt]\"&E207","v":"[pt]Berührungsgruppen & Werte"},{"$f":"\"[gr]\"&E207","v":"[gr]Berührungsgruppen & Werte"}]
[{"$nulls":3},{"$f":"HLOOKUP($C$1,$E$1:$X$4910,ROW(D208))","v":"General"},"Allgemein","Generale","General","General",{"$f":"\"[fr]\"&E208","v":"[fr]Allgemein"},{"$f":"\"[pt]\"&E208","v":"[pt]Allgemein"},{"$f":"\"[gr]\"&E208","v":"[gr]Allgemein"}]
[{"$nulls":3},{"$f":"HLOOKUP($C$1,$E$1:$X$4910,ROW(D209))","v":"Notes"},"Anmerkungen","Note","Notes","Notas aclaratorias",{"$f":"\"[fr]\"&E209","v":"[fr]Anmerkungen"},{"$f":"\"[pt]\"&E209","v":"[pt]Anmerkungen"},{"$f":"\"[gr]\"&E209","v":"[gr]Anmerkungen"}]
[{"$nulls":3},{"$f":"HLOOKUP($C$1,$E$1:$X$4910,ROW(D210))","v":"(scaled for STs)"}," (für EPUs skaliert)"," (scalato per imprese individuali)"," (scaled for STs)","(ponderado para empresas unipersonales)",{"$f":"\"[fr]\"&E210","v":"[fr] (für EPUs skaliert)"},{"$f":"\"[pt]\"&E210","v":"[pt] (für EPUs skaliert)"},{"$f":"\"[gr]\"&E210","v":"[gr] (für EPUs skaliert)"}]
[{"$nulls":3},{"$f":"HLOOKUP($C$1,$E$1:$X$4910,ROW(D211))","v":"(not relevant for STs)"}," (für EPUs nicht relevant)"," (non rilevante per imprese di un collaboratore)"," (not relevant for STs)","(no aplica en empresas unipersonales)",{"$f":"\"[fr]\"&E211","v":"[fr] (für EPUs nicht relevant)"},{"$f":"\"[pt]\"&E211","v":"[pt] (für EPUs nicht relevant)"},{"$f":"\"[gr]\"&E211","v":"[gr] (für EPUs nicht relevant)"}]
[{"$nulls":3},{"$f":"HLOOKUP($C$1,$E$1:$X$4910,ROW(D212))","v":"Note: This is not a certificate."},"Anmerkung: Dies ist kein Testat.","Annotazione: Questo non è un attestato.","Note: This is not a certificate.","Nota: esto no es un certificado",{"$f":"\"[fr]\"&E212","v":"[fr]Anmerkung: Dies ist kein Testat."},{"$f":"\"[pt]\"&E212","v":"[pt]Anmerkung: Dies ist kein Testat."},{"$f":"\"[gr]\"&E212","v":"[gr]Anmerkung: Dies ist kein Testat."}]
[{"$nulls":3},{"$f":"HLOOKUP($C$1,$E$1:$X$4910,ROW(D213))","v":"COMMON GOOD MATRIX"},"GEMEINWOHL-MATRIX","MATRICE DEL BENE COMUNE","COMMON GOOD MATRIX","MATRIZ DEL BIEN COMÚN",{"$f":"\"[fr]\"&E213","v":"[fr]GEMEINWOHL-MATRIX"},{"$f":"\"[pt]\"&E213","v":"[pt]GEMEINWOHL-MATRIX"},{"$f":"\"[gr]\"&E213","v":"[gr]GEMEINWOHL-MATRIX"}]
[{"$nulls":3},{"$f":"HLOOKUP($C$1,$E$1:$X$4910,ROW(D214))","v":"of"}," von "," di ","of","de",{"$f":"\"[fr]\"&E214","v":"[fr] von"},{"$f":"\"[pt]\"&E214","v":"[pt] von"},{"$f":"\"[gr]\"&E214","v":"[gr] von"}]
[{"$nulls":3},{"$f":"HLOOKUP($C$1,$E$1:$X$4910,ROW(D215))","v":"points"}," Punkten"," punti"," points"," Puntos",{"$f":"\"[fr]\"&E215","v":"[fr] Punkten"},{"$f":"\"[pt]\"&E215","v":"[pt] Punkten"},{"$f":"\"[gr]\"&E215","v":"[gr] Punkten"}]
[{"$nulls":3},{"$f":"HLOOKUP($C$1,$E$1:$X$4910,ROW(D216))","v":"Human dignity"},"Menschenwürde","Dignità umana","Human dignity","Dignidad humana",{"$f":"\"[fr]\"&E216","v":"[fr]Menschenwürde"},{"$f":"\"[pt]\"&E216","v":"[pt]Menschenwürde"},{"$f":"\"[gr]\"&E216","v":"[gr]Menschenwürde"}]
[{"$nulls":3},{"$f":"HLOOKUP($C$1,$E$1:$X$4910,ROW(D217))","v":"Solidarity & social justice"},"Solidarität & Gerechtigkeit","Solidarietà & giustizia","Solidarity & social justice","Solidaridad y justicia",{"$f":"\"[fr]\"&E217","v":"[fr]Solidarität & Gerechtigkeit"},{"$f":"\"[pt]\"&E217","v":"[pt]Solidarität & Gerechtigkeit"},{"$f":"\"[gr]\"&E217","v":"[gr]Solidarität & Gerechtigkeit"}]
[{"$nulls":3},{"$f":"HLOOKUP($C$1,$E$1:$X$4910,ROW(D218))","v":"Environmental sustainability"},"Ökologische Nachhaltigkeit","Sostenibilità ambientale","Environmental sustainability","Sostenibilidad medioambiental",{"$f":"\"[fr]\"&E218","v":"[fr]Ökologische Nachhaltigkeit"},{"$f":"\"[pt]\"&E218","v":"[pt]Ökologische Nachhaltigkeit"},{"$f":"\"[gr]\"&E218","v":"[gr]Ökologische Nachhaltigkeit"}]
[{"$nulls":3},{"$f":"HLOOKUP($C$1,$E$1:$X$4910,ROW(D219))","v":"Transparency & co-determination"},"Transparenz & Mitentscheidung","Trasparenza & cogestione","Transparency & co-determination","Transparencia y participación democrática",{"$f":"\"[fr]\"&E219","v":"[fr]Transparenz & Mitentscheidung"},{"$f":"\"[pt]\"&E219","v":"[pt]Transparenz & Mitentscheidung"},{"$f":"\"[gr]\"&E219","v":"[gr]Transparenz & Mitentscheidung"}]
[{"$nulls":3},{"$f":"HLOOKUP($C$1,$E$1:$X$4910,ROW(D220))","v":"Common Good Star for"},"Gemeinwohl-Stern für","Stella del Bene Comune per","Common Good Star for","Diagrama de araña de",{"$f":"\"[fr]\"&E220","v":"[fr]Gemeinwohl-Stern für"},{"$f":"\"[pt]\"&E220","v":"[pt]Gemeinwohl-Stern für"},{"$f":"\"[gr]\"&E220","v":"[gr]Gemeinwohl-Stern für"}]
[{"$nulls":3},{"$f":"HLOOKUP($C$1,$E$1:$X$4910,ROW(D221))","v":"BALANCE OVERVIEW"},"BILANZ-ÜBERSICHT","QUADRO DEL BILANCIO","BALANCE OVERVIEW","VISTA GLOBAL DEL BALANCE",{"$f":"\"[fr]\"&E221","v":"[fr]BILANZ-ÜBERSICHT"},{"$f":"\"[pt]\"&E221","v":"[pt]BILANZ-ÜBERSICHT"},{"$f":"\"[gr]\"&E221","v":"[gr]BILANZ-ÜBERSICHT"}]
[{"$nulls":3},{"$f":"HLOOKUP($C$1,$E$1:$X$4910,ROW(D222))","v":"TRANSPARENCY & CO-DETERMINATION"},"MITBESTIMMUNG UND TRANSPARENZ","COGESTIONE E TRASPARENZA","TRANSPARENCY & CO-DETERMINATION","TRANSPARENCIA Y PARTICIPACIÓN DEMOCRÁTICA",{"$f":"\"[fr]\"&E222","v":"[fr]MITBESTIMMUNG UND TRANSPARENZ"},{"$f":"\"[pt]\"&E222","v":"[pt]MITBESTIMMUNG UND TRANSPARENZ"},{"$f":"\"[gr]\"&E222","v":"[gr]MITBESTIMMUNG UND TRANSPARENZ"}]
[{"$nulls":3},{"$f":"HLOOKUP($C$1,$E$1:$X$4910,ROW(D223))","v":"HUMAN DIGNITY"},"MENSCHENWÜRDE","DIGNITA’ UMANA","HUMAN DIGNITY","DIGNIDAD HUMANA",{"$f":"\"[fr]\"&E223","v":"[fr]MENSCHENWÜRDE"},{"$f":"\"[pt]\"&E223","v":"[pt]MENSCHENWÜRDE"},{"$f":"\"[gr]\"&E223","v":"[gr]MENSCHENWÜRDE"}]
[{"$nulls":3},{"$f":"HLOOKUP($C$1,$E$1:$X$4910,ROW(D224))","v":"SOLIDARITY"},"SOLIDARITÄT","SOLIDARIETA’","SOLIDARITY","SOLIDARIDAD",{"$f":"\"[fr]\"&E224","v":"[fr]SOLIDARITÄT"},{"$f":"\"[pt]\"&E224","v":"[pt]SOLIDARITÄT"},{"$f":"\"[gr]\"&E224","v":"[gr]SOLIDARITÄT"}]
[{"$nulls":3},{"$f":"HLOOKUP($C$1,$E$1:$X$4910,ROW(D225))","v":"ENVIRONMENTAL SUSTAINABILITY"},"ÖKOLOGISCHE NACHHALTIGKEIT","SOSTENIBILITA’ AMBIENTALE","ENVIRONMENTAL SUSTAINABILITY","SOSTENIBILIDAD MEDIOAMBIENTAL",{"$f":"\"[fr]\"&E225","v":"[fr]ÖKOLOGISCHE NACHHALTIGKEIT"},{"$f":"\"[pt]\"&E225","v":"[pt]ÖKOLOGISCHE NACHHALTIGKEIT"},{"$f":"\"[gr]\"&E225","v":"[gr]ÖKOLOGISCHE NACHHALTIGKEIT"}]
[{"$nulls":3},{"$f":"HLOOKUP($C$1,$E$1:$X$4910,ROW(D226))","v":"SOCIAL JUSTICE"},"SOZIALE GERECHTIGKEIT","GIUSTIZIA SOCIALE","SOCIAL JUSTICE","JUSTICIA SOCIAL",{"$f":"\"[fr]\"&E226","v":"[fr]SOZIALE GERECHTIGKEIT"},{"$f":"\"[pt]\"&E226","v":"[pt]SOZIALE GERECHTIGKEIT"},{"$f":"\"[gr]\"&E226","v":"[gr]SOZIALE GERECHTIGKEIT"}]
[{"$nulls":3},{"$f":"HLOOKUP($C$1,$E$1:$X$4910,ROW(D227))","v":"TRANSPARENCY & CO-DETERMINATION"},"MITBESTIMMUNG UND TRANSPARENZ","COGESTIONE E TRASPARENZA","TRANSPARENCY & CO-DETERMINATION","TRANSPARENCIA Y PARTICIPACIÓN DEMOCRÁTICA",{"$f":"\"[fr]\"&E227","v":"[fr]MITBESTIMMUNG UND TRANSPARENZ"},{"$f":"\"[pt]\"&E227","v":"[pt]MITBESTIMMUNG UND TRANSPARENZ"},{"$f":"\"[gr]\"&E227","v":"[gr]MITBESTIMMUNG UND TRANSPARENZ"}]
[{"$nulls":3},{"$f":"HLOOKUP($C$1,$E$1:$X$4910,ROW(D228))","v":"TOTAL"},"SUMME","SOMMA","TOTAL","TOTAL",{"$f":"\"[fr]\"&E228","v":"[fr]SUMME"},{"$f":"\"[pt]\"&E228","v":"[pt]SUMME"},{"$f":"\"[gr]\"&E228","v":"[gr]SUMME"}]
[{"$nulls":3},{"$f":"HLOOKUP($C$1,$E$1:$X$4910,ROW(D229))","v":"(scaled for STs)"},"(für EPUs skaliert)","(valori scalati per l’impresa di 1 persona)","(scaled for STs)","(ponderado para empresas unipersonales)",{"$f":"\"[fr]\"&E229","v":"[fr](für EPUs skaliert)"},{"$f":"\"[pt]\"&E229","v":"[pt](für EPUs skaliert)"},{"$f":"\"[gr]\"&E229","v":"[gr](für EPUs skaliert)"}]
[{"$nulls":3},{"$f":"HLOOKUP($C$1,$E$1:$X$4910,ROW(D230))","v":"Documentation of assessment"},"Dokumentation der Bewertung","Documentazione della valutazione","Documentation of assessment","Documentación de la puntuación",{"$f":"\"[fr]\"&E230","v":"[fr]Dokumentation der Bewertung"},{"$f":"\"[pt]\"&E230","v":"[pt]Dokumentation der Bewertung"},{"$f":"\"[gr]\"&E230","v":"[gr]Dokumentation der Bewertung"}]
[{"$nulls":3},{"$f":"HLOOKUP($C$1,$E$1:$X$4910,ROW(D231))","v":"Self-assessment"},"Selbsteinschätzung","Valutazione propria","Self-assessment","Autoevaluación",{"$f":"\"[fr]\"&E231","v":"[fr]Selbsteinschätzung"},{"$f":"\"[pt]\"&E231","v":"[pt]Selbsteinschätzung"},{"$f":"\"[gr]\"&E231","v":"[gr]Selbsteinschätzung"}]
[{"$nulls":3},{"$f":"HLOOKUP($C$1,$E$1:$X$4910,ROW(D232))","v":"Peer-assessment"},"Peer-Evaluation","Valutazione peer","Peer-assessment","Evaluación peer",{"$f":"\"[fr]\"&E232","v":"[fr]Peer-Evaluation"},{"$f":"\"[pt]\"&E232","v":"[pt]Peer-Evaluation"},{"$f":"\"[gr]\"&E232","v":"[gr]Peer-Evaluation"}]
[{"$nulls":3},{"$f":"HLOOKUP($C$1,$E$1:$X$4910,ROW(D233))","v":"Provisional audit assessment"},"Provisorische Bewertung des externen Audits","Valutazione esterna bozza","Provisional audit assessment","Puntuación provisional de la auditoría externa",{"$f":"\"[fr]\"&E233","v":"[fr]Provisorische Bewertung des externen Audits"},{"$f":"\"[pt]\"&E233","v":"[pt]Provisorische Bewertung des externen Audits"},{"$f":"\"[gr]\"&E233","v":"[gr]Provisorische Bewertung des externen Audits"}]
[{"$nulls":3},{"$f":"HLOOKUP($C$1,$E$1:$X$4910,ROW(D234))","v":"Agreed audit assessment"},"Definitive Bewertung externen Audits /Peer","Valutazione definitiva audit esterno/Peer","Agreed audit assessment","Puntuación definitiva de la auditoría externa/Peer",{"$f":"\"[fr]\"&E234","v":"[fr]Definitive Bewertung externen Audits /Peer"},{"$f":"\"[pt]\"&E234","v":"[pt]Definitive Bewertung externen Audits /Peer"},{"$f":"\"[gr]\"&E234","v":"[gr]Definitive Bewertung externen Audits /Peer"}]
[{"$nulls":3},{"$f":"HLOOKUP($C$1,$E$1:$X$4910,ROW(D235))","v":"Password for EXCEL sheet protection \"ebc\""},"Passwort für den Schutz der Tabellen: „ebc“","Password per la protezione delle tabelle: „ebc“","Password for EXCEL sheet protection \"ebc\"","Contraseña de esta hoja de cálculo: “ebc”",{"$f":"\"[fr]\"&E235","v":"[fr]Passwort für den Schutz der Tabellen: „ebc“"},{"$f":"\"[pt]\"&E235","v":"[pt]Passwort für den Schutz der Tabellen: „ebc“"},{"$f":"\"[gr]\"&E235","v":"[gr]Passwort für den Schutz der Tabellen: „ebc“"}]
[null,null,3,{"$f":"HLOOKUP($C$1,$E$1:$X$4910,ROW(D236))","v":"high"},"hoch","alto","high","alta",{"$f":"\"[fr]\"&E236","v":"[fr]hoch"},{"$f":"\"[pt]\"&E236","v":"[pt]hoch"},{"$f":"\"[gr]\"&E236","v":"[gr]hoch"}]
[null,null,2,{"$f":"HLOOKUP($C$1,$E$1:$X$4910,ROW(D237))","v":"medium"},"mittel","medio","medium","media",{"$f":"\"[fr]\"&E237","v":"[fr]mittel"},{"$f":"\"[pt]\"&E237","v":"[pt]mittel"},{"$f":"\"[gr]\"&E237","v":"[gr]mittel"}]
[null,null,1,{"$f":"HLOOKUP($C$1,$E$1:$X$4910,ROW(D238))","v":"low"},"niedrig","basso","low","baja",{"$f":"\"[fr]\"&E238","v":"[fr]niedrig"},{"$f":"\"[pt]\"&E238","v":"[pt]niedrig"},{"$f":"\"[gr]\"&E238","v":"[gr]niedrig"}]
[null,null,0,{"$f":"HLOOKUP($C$1,$E$1:$X$4910,ROW(D239))","v":"non applicable"},"trifft nicht zu","non applicabile","non applicable","no aplica",{"$f":"\"[fr]\"&E239","v":"[fr]trifft nicht zu"},{"$f":"\"[pt]\"&E239","v":"[pt]trifft nicht zu"},{"$f":"\"[gr]\"&E239","v":"[gr]trifft nicht zu"}]
[{"$nulls":3},{"$f":"HLOOKUP($C$1,$E$1:$X$4910,ROW(D240))","v":"Weighting changed. Original"},"Gewichtung geändert. Ursprünglich ","Peso cambiato. Originale ","Weighting changed. Original ","Ponderación cambiada. Original ",{"$f":"\"[fr]\"&E240","v":"[fr]Gewichtung geändert. Ursprünglich"},{"$f":"\"[pt]\"&E240","v":"[pt]Gewichtung geändert. Ursprünglich"},{"$f":"\"[gr]\"&E240","v":"[gr]Gewichtung geändert. Ursprünglich"}]
[{"$nulls":3},{"$f":"HLOOKUP($C$1,$E$1:$X$4910,ROW(D241))","v":"Values star for"},"Werte-Stern für ","Stella dei valori per ","Values star for ","Diagrama de araña. Valores de",{"$f":"\"[fr]\"&E241","v":"[fr]Werte-Stern für"},{"$f":"\"[pt]\"&E241","v":"[pt]Werte-Stern für"},{"$f":"\"[gr]\"&E241","v":"[gr]Werte-Stern für"}]
[{"$nulls":3},{"$f":"HLOOKUP($C$1,$E$1:$X$4910,ROW(D242))","v":"Group star for"},"Gruppen-Stern für ","Stella dei gruppi per ","Group star for ","Diagrama de araña. Grupos de interés de",{"$f":"\"[fr]\"&E242","v":"[fr]Gruppen-Stern für"},{"$f":"\"[pt]\"&E242","v":"[pt]Gruppen-Stern für"},{"$f":"\"[gr]\"&E242","v":"[gr]Gruppen-Stern für"}]
[{"$nulls":3},{"$f":"HLOOKUP($C$1,$E$1:$X$4910,ROW(D243))","v":"Theme star for"},"Themen-Stern für ","Stella dei temi per ","Theme star for ","Diagrama de araña. Temas de",{"$f":"\"[fr]\"&E243","v":"[fr]Themen-Stern für"},{"$f":"\"[pt]\"&E243","v":"[pt]Themen-Stern für"},{"$f":"\"[gr]\"&E243","v":"[gr]Themen-Stern für"}]
[null,{"$f":"D208","v":"General"},null,{"$f":"HLOOKUP($C$1,$E$1:$X$4910,ROW(D244))","v":"The allocation of equal and fixed scores for all companies has been the subject of much discussion within the Matrix-development team during the past few years. Outside sources have also raised many questions and provided feedback. Untill now, the way points are distributed for themes has been the same for all companies (with the exception of one-person companies), regardless of company size, industry and other parameters (regional background, B2B versus B2C, etc.). However, these variables may well have an effect on the relevance to and effect on the common good.For example, the supply chain of an electronics trading company (A1-A4) is more significant than for a mining company, which, in turn, leaves a huge, direct environmental impact, amongst other things (E3). The new weighting model addresses these issues and highlights the significant factors. A survey on the changes was conducted, with feedback clearly favouring a new approach."},"Die für alle Unternehmen gleiche und starre Punkteverteilung in der Matrix hat in den vergangenen Jahren innerhalb des Matrix-Entwicklungs-Team (MET) für viele Diskussionen gesorgt. Auch von außerhalb sind viele Fragen und kritische Rückmeldungen an uns herangetragen worden. Bislang war die Punkteverteilung auf die Themen mit Ausnahme von Ein-Personen-Unternehmen für alle Unternehmen gleich - unabhängig von der Unternehmensgröße, Branche und anderen Rahmenbedingungen (regionaler Hintergrund, B2B versus B2C, etc.). Relevanz und WirkungImpact auf das Gemeinwohl sind jedoch von diesen Determinanten nicht unabhängig. Beispielsweise ist die Lieferkette eines Elektronik-Handelsunternehmen (A1-A4) weitaus bedeutender als für ein Bergbauunternehmen, welches wiederum u.a. sehr große Effekte bei seinen direkten ökologischen Auswirkungen hat (E3). Das neue Gewichtungsmodell soll diesen Gedanken Rechnung tragen und die wesentlichen Faktoren stärker akzentuieren. Im Prozess wurden Meinungen der Bewegung im Rahmen einer Umfrage eingeholt und eine klare Präferenz für eine neue Herangehensweise rückgemeldet.","La stessa distribuzione di punti nella matrice, che è la stessa per tutte le imprese, ha suscitato molto dibattito all'interno del Gruppo di Sviluppo della Matrice (GSM) negli ultimi anni. Anche dall'esterno molte domande e feedback critici ci sono stati portati. Fino ad ora, la distribuzione dei punti sui problemi con l'eccezione di imprese individuali stesse per tutte le aziende - indipendentemente dalle dimensioni dell'azienda, l'industria, e le altre condizioni (di fondo regionale, B2B B2C contro, etc.). Rilevanza e impatto L'impatto sul bene comune, tuttavia, non è indipendente da questi fattori determinanti. Ad esempio, la catena di approvvigionamento di una società commerciale di elettronica (A1-A4) è molto più significativa che per una società mineraria, che a ha effetti molto grandi sul suo impatto ambientale diretto (E3). Il nuovo modello di ponderazione dovrebbe riflettere questa idea e accentuare maggiormente i fattori chiave. Durante il processo, le opinioni sul movimento sono state raccolte attraverso un sondaggio e una chiara preferenza per un nuovo approccio è stata confermata.","The allocation of equal and fixed scores for all companies has been the subject of much discussion within the Matrix-development team during the past few years. Outside sources have also raised many questions and provided feedback. Untill now, the way points are distributed for themes has been the same for all companies (with the exception of one-person companies), regardless of company size, industry and other parameters (regional background, B2B versus B2C, etc.). However, these variables may well have an effect on the relevance to and effect on the common good.For example, the supply chain of an electronics trading company (A1-A4) is more significant than for a mining company, which, in turn, leaves a huge, direct environmental impact, amongst other things (E3). The new weighting model addresses these issues and highlights the significant factors. A survey on the changes was conducted, with feedback clearly favouring a new approach. ","La distribución de la puntuación entre los diferentes temas era igual para cualquier tipo de empresas hasta esta versión. Esta cuestión ha sido debatida en el equipo de desarrollo de la matriz en los últimos años. También hemos recibido muchas preguntas y críticas desde fuera a este respecto. Hasta ahora, la distribución de puntuación era para todas las empresas igual, excepto para empresas unipersonales, independientemente del tamaño de la empresa, el sector y otros factores (región, B2B o B2C, etc.) Sin embargo, la relevancia y el impacto en el Bien Común no son independientes de estas variables. Por ejemplo, si una empresa tiene una cadena de suministro en el sector de la electrónica tendrá mayor relevancia lo relevativo a los temas A1 – A4 que la industria minera, que sin embargo tendrá mucha relevancia en los impactos ambientales directos, tratados en E3. El nuevo método de ponderación tiene en cuenta estas cuestiones y acentúa la importancia de los factores fundamentales. Dentro de este proceso se recopilaron las opiniones del movimiento en una encuesta que dio como resultado una preferencia clara por tratar este tema con un nuevo método.",{"$f":"\"[fr]\"&E244","v":"[fr]Die für alle Unternehmen gleiche und starre Punkteverteilung in der Matrix hat in den vergangenen Jahren innerhalb des Matrix-Entwicklungs-Team (MET) für viele Diskussionen gesorgt. Auch von außerhalb sind viele Fragen und kritische Rückmeldungen an uns herangetragen worden. Bislang war die Punkteverteilung auf die Themen mit Ausnahme von Ein-Personen-Unternehmen für alle Unternehmen gleich - unabhängig von der Unternehmensgröße, Branche und anderen Rahmenbedingungen (regionaler Hintergrund, B2B versus B2C, etc.). Relevanz und WirkungImpact auf das Gemeinwohl sind jedoch von diesen Determinanten nicht unabhängig. Beispielsweise ist die Lieferkette eines Elektronik-Handelsunternehmen (A1-A4) weitaus bedeutender als für ein Bergbauunternehmen, welches wiederum u.a. sehr große Effekte bei seinen direkten ökologischen Auswirkungen hat (E3). Das neue Gewichtungsmodell soll diesen Gedanken Rechnung tragen und die wesentlichen Faktoren stärker akzentuieren. Im Prozess wurden Meinungen der Bewegung im Rahmen einer Umfrage eingeholt und eine klare Präferenz für eine neue Herangehensweise rückgemeldet."},{"$f":"\"[pt]\"&E244","v":"[pt]Die für alle Unternehmen gleiche und starre Punkteverteilung in der Matrix hat in den vergangenen Jahren innerhalb des Matrix-Entwicklungs-Team (MET) für viele Diskussionen gesorgt. Auch von außerhalb sind viele Fragen und kritische Rückmeldungen an uns herangetragen worden. Bislang war die Punkteverteilung auf die Themen mit Ausnahme von Ein-Personen-Unternehmen für alle Unternehmen gleich - unabhängig von der Unternehmensgröße, Branche und anderen Rahmenbedingungen (regionaler Hintergrund, B2B versus B2C, etc.). Relevanz und WirkungImpact auf das Gemeinwohl sind jedoch von diesen Determinanten nicht unabhängig. Beispielsweise ist die Lieferkette eines Elektronik-Handelsunternehmen (A1-A4) weitaus bedeutender als für ein Bergbauunternehmen, welches wiederum u.a. sehr große Effekte bei seinen direkten ökologischen Auswirkungen hat (E3). Das neue Gewichtungsmodell soll diesen Gedanken Rechnung tragen und die wesentlichen Faktoren stärker akzentuieren. Im Prozess wurden Meinungen der Bewegung im Rahmen einer Umfrage eingeholt und eine klare Präferenz für eine neue Herangehensweise rückgemeldet."},{"$f":"\"[gr]\"&E244","v":"[gr]Die für alle Unternehmen gleiche und starre Punkteverteilung in der Matrix hat in den vergangenen Jahren innerhalb des Matrix-Entwicklungs-Team (MET) für viele Diskussionen gesorgt. Auch von außerhalb sind viele Fragen und kritische Rückmeldungen an uns herangetragen worden. Bislang war die Punkteverteilung auf die Themen mit Ausnahme von Ein-Personen-Unternehmen für alle Unternehmen gleich - unabhängig von der Unternehmensgröße, Branche und anderen Rahmenbedingungen (regionaler Hintergrund, B2B versus B2C, etc.). Relevanz und WirkungImpact auf das Gemeinwohl sind jedoch von diesen Determinanten nicht unabhängig. Beispielsweise ist die Lieferkette eines Elektronik-Handelsunternehmen (A1-A4) weitaus bedeutender als für ein Bergbauunternehmen, welches wiederum u.a. sehr große Effekte bei seinen direkten ökologischen Auswirkungen hat (E3). Das neue Gewichtungsmodell soll diesen Gedanken Rechnung tragen und die wesentlichen Faktoren stärker akzentuieren. Im Prozess wurden Meinungen der Bewegung im Rahmen einer Umfrage eingeholt und eine klare Präferenz für eine neue Herangehensweise rückgemeldet."}]
[null,"Berührungsgruppen & Werte",null,{"$f":"HLOOKUP($C$1,$E$1:$X$4910,ROW(D245))","v":"For the weighting of three stakeholder groups, A) suppliers, B) investors and C) employees, the matrix takes into account the following financial flows to these stakeholders: A) procurement expenditure, B) profit and borrowing costs C) wages and salaries. We are aware of the limited significance attached to money in the current matrix and have plans for how this can be improved in the future. At the same time, this information is readily available in companies' financial balance sheets, and easily meets the needs of many companies. Since taxes and borrowing costs are included in procurement expenditure, these account for only 50% of the weighting."},"Bei der Gewichtung der 3 Berührungsgruppen A) LieferantInnen, B) InvestorenInnen und C) MitarbeiterInnen werden die Finanzströme zu diesen Berührungsgruppen zur Gewichtung herangezogen: A) Beschaffungsausgaben, B) Gewinn und Finanzierungskosten C) Löhne und Gehälter. Wir sind uns der limitierten Aussagekraft monetärer Größen bewusst und haben auch Ideen, wie dies in Zukunft verbessert werden kann. Gleichzeitig sind diese Zahlen in der  Finanzbilanzen der Unternehmen vorhanden, somit leicht verfügbar und kommen dem Bedürfnis vieler Unternehmen nach Einfachheit nach. Da in den Beschaffungskosten Steuern und Finanzierungskosten entahlten fliessen diese nur zu 50% in die Gewichtung ein. ","Quando ponderate i 3 gruppi di contatto A) Fornitori, B) Investitori e C) Dipendenti, i flussi finanziari verso questi gruppi tattili sono ponderati come segue: A) Spese di approvvigionamento, B) Costi di profitto e di finanziamento C) Retribuzioni. Siamo consapevoli della validità limitata delle risorse monetarie e abbiamo anche idee su come migliorarle in futuro. Allo stesso tempo, queste cifre sono presenti nei conti finanziari delle aziende, quindi facilmente disponibili e soddisfano le esigenze di molte aziende per semplicità. Poiché le tasse e i costi di finanziamento erano inclusi nei costi di approvvigionamento, questi rappresentavano solo il 50% della ponderazione.","For the weighting of three stakeholder groups, A) suppliers, B) investors and C) employees, the matrix takes into account the following financial flows to these stakeholders: A) procurement expenditure, B) profit and borrowing costs C) wages and salaries. We are aware of the limited significance attached to money in the current matrix and have plans for how this can be improved in the future. At the same time, this information is readily available in companies' financial balance sheets, and easily meets the needs of many companies. Since taxes and borrowing costs are included in procurement expenditure, these account for only 50% of the weighting.","En la ponderación de los grupos de interés A) Proveedores, B) Inversores y socios financieros y C) Trabajadores se toman como referencia los flujos financieros. Para A) los gastos en compras, para B) beneficios y costes financieros y para C) la remuneración. Somos conscientes de las limitaciones que presenta el basar esta ponderación en valores monetarios, y por eso estamos desarrollando ideas de como puede mejorarse en el futuro. Por otro lado, los datos requeridos se encuentran en los balances financieros de las empresas, con lo que son datos fácilmente disponibles, siendo más sencillo para las empresas. Como en los gastos de proveedores también se encuentran los impuestos y costes financieros, sólo se tiene en cuenta el 50% de este valor a la hora de hacer la ponderación.",{"$f":"\"[fr]\"&E245","v":"[fr]Bei der Gewichtung der 3 Berührungsgruppen A) LieferantInnen, B) InvestorenInnen und C) MitarbeiterInnen werden die Finanzströme zu diesen Berührungsgruppen zur Gewichtung herangezogen: A) Beschaffungsausgaben, B) Gewinn und Finanzierungskosten C) Löhne und Gehälter. Wir sind uns der limitierten Aussagekraft monetärer Größen bewusst und haben auch Ideen, wie dies in Zukunft verbessert werden kann. Gleichzeitig sind diese Zahlen in der  Finanzbilanzen der Unternehmen vorhanden, somit leicht verfügbar und kommen dem Bedürfnis vieler Unternehmen nach Einfachheit nach. Da in den Beschaffungskosten Steuern und Finanzierungskosten entahlten fliessen diese nur zu 50% in die Gewichtung ein."},{"$f":"\"[pt]\"&E245","v":"[pt]Bei der Gewichtung der 3 Berührungsgruppen A) LieferantInnen, B) InvestorenInnen und C) MitarbeiterInnen werden die Finanzströme zu diesen Berührungsgruppen zur Gewichtung herangezogen: A) Beschaffungsausgaben, B) Gewinn und Finanzierungskosten C) Löhne und Gehälter. Wir sind uns der limitierten Aussagekraft monetärer Größen bewusst und haben auch Ideen, wie dies in Zukunft verbessert werden kann. Gleichzeitig sind diese Zahlen in der  Finanzbilanzen der Unternehmen vorhanden, somit leicht verfügbar und kommen dem Bedürfnis vieler Unternehmen nach Einfachheit nach. Da in den Beschaffungskosten Steuern und Finanzierungskosten entahlten fliessen diese nur zu 50% in die Gewichtung ein."},{"$f":"\"[gr]\"&E245","v":"[gr]Bei der Gewichtung der 3 Berührungsgruppen A) LieferantInnen, B) InvestorenInnen und C) MitarbeiterInnen werden die Finanzströme zu diesen Berührungsgruppen zur Gewichtung herangezogen: A) Beschaffungsausgaben, B) Gewinn und Finanzierungskosten C) Löhne und Gehälter. Wir sind uns der limitierten Aussagekraft monetärer Größen bewusst und haben auch Ideen, wie dies in Zukunft verbessert werden kann. Gleichzeitig sind diese Zahlen in der  Finanzbilanzen der Unternehmen vorhanden, somit leicht verfügbar und kommen dem Bedürfnis vieler Unternehmen nach Einfachheit nach. Da in den Beschaffungskosten Steuern und Finanzierungskosten entahlten fliessen diese nur zu 50% in die Gewichtung ein."}]
[null,"Themen",null,{"$f":"HLOOKUP($C$1,$E$1:$X$4910,ROW(D246))","v":"There are also criteria for the weighting of the themes, for example a company's size or industry or the relevant local employment law. The United Nations' International Standard Industrial Classification of All Economic Activities (ISIC Rev.4) is used for all industry sector definitions. For size classification, definitions as set out by the EU are used. The table below summarises the current weighting factors (as at May 2017):"},"Auf Ebene der Themen gibt es ebenfalls Kriterien die zur Gewichtung herangezogen werden, beispielsweise Größe oder Branche eines Unternehmen oder Arbeitsrechtslage von Ländern. Für die Branchendefinition wenden wir den International Standard Industrial Classification of All Economic Activities (ISIC Rev.4) der Vereinten Nationen an. Für die Größeneinstufung wird die EU Definition herangezogen. Die nachstehende Tabelle fasst gegenwärtige Gewichtungsfaktoren zusammen (Stand Mai 2017).","A livello di argomenti ci sono anche i criteri che vengono utilizzati per ponderazione, come la dimensione o il settore di una situazione aziendale o di lavoro i diritti dei paesi. Per la definizione del settore, utilizziamo la classificazione internazionale standard internazionale delle Nazioni Unite di tutte le attività economiche (ISIC Rev.4). La classificazione delle taglie si basa sulla definizione UE. La tabella seguente riepiloga i fattori di ponderazione correnti (a partire da maggio 2017).","There are also criteria for the weighting of the themes, for example a company's size or industry or the relevant local employment law. The United Nations' International Standard Industrial Classification of All Economic Activities (ISIC Rev.4) is used for all industry sector definitions. For size classification, definitions as set out by the EU are used. The table below summarises the current weighting factors (as at May 2017):","En la ponderación de los temas también se tienen en cuenta criterios específicos, como por ejemplo el tamaño, el sector o la región. Para la definición de sectores utilizamos la Clasificación Internacional Industrial Uniforme (ISIC Rev. 4 por sos siglas en inglés) de las naciones unidas. En cuanto al tamaño se utiliza la definición de la UE. La siguiente tabla muestra los factores de ponderación actuales (Mayo 2017) ",{"$f":"\"[fr]\"&E246","v":"[fr]Auf Ebene der Themen gibt es ebenfalls Kriterien die zur Gewichtung herangezogen werden, beispielsweise Größe oder Branche eines Unternehmen oder Arbeitsrechtslage von Ländern. Für die Branchendefinition wenden wir den International Standard Industrial Classification of All Economic Activities (ISIC Rev.4) der Vereinten Nationen an. Für die Größeneinstufung wird die EU Definition herangezogen. Die nachstehende Tabelle fasst gegenwärtige Gewichtungsfaktoren zusammen (Stand Mai 2017)."},{"$f":"\"[pt]\"&E246","v":"[pt]Auf Ebene der Themen gibt es ebenfalls Kriterien die zur Gewichtung herangezogen werden, beispielsweise Größe oder Branche eines Unternehmen oder Arbeitsrechtslage von Ländern. Für die Branchendefinition wenden wir den International Standard Industrial Classification of All Economic Activities (ISIC Rev.4) der Vereinten Nationen an. Für die Größeneinstufung wird die EU Definition herangezogen. Die nachstehende Tabelle fasst gegenwärtige Gewichtungsfaktoren zusammen (Stand Mai 2017)."},{"$f":"\"[gr]\"&E246","v":"[gr]Auf Ebene der Themen gibt es ebenfalls Kriterien die zur Gewichtung herangezogen werden, beispielsweise Größe oder Branche eines Unternehmen oder Arbeitsrechtslage von Ländern. Für die Branchendefinition wenden wir den International Standard Industrial Classification of All Economic Activities (ISIC Rev.4) der Vereinten Nationen an. Für die Größeneinstufung wird die EU Definition herangezogen. Die nachstehende Tabelle fasst gegenwärtige Gewichtungsfaktoren zusammen (Stand Mai 2017)."}]
[null,"A1",null,{"$f":"HLOOKUP($C$1,$E$1:$X$4910,ROW(D247))","v":"The weighting of this theme is dependent on the social risks of the supplier's sector."},"Die Gewichtung dieses Thema’s ist abhängig von den sozialen Risiken der Zulieferbranchen","La ponderazione di questo tema dipende dai rischi sociali del settore dei fornitori","The weighting of this theme is dependent on the social risks of the supplier's sector.","La ponderación de este tema depende de los riesgos sociales en la cadena de suministro.",{"$f":"\"[fr]\"&E247","v":"[fr]Die Gewichtung dieses Thema’s ist abhängig von den sozialen Risiken der Zulieferbranchen"},{"$f":"\"[pt]\"&E247","v":"[pt]Die Gewichtung dieses Thema’s ist abhängig von den sozialen Risiken der Zulieferbranchen"},{"$f":"\"[gr]\"&E247","v":"[gr]Die Gewichtung dieses Thema’s ist abhängig von den sozialen Risiken der Zulieferbranchen"}]
[null,"A2",null,{"$f":"HLOOKUP($C$1,$E$1:$X$4910,ROW(D248))","v":"-"},"-","-","-","-",{"$f":"\"[fr]\"&E248","v":"[fr]-"},{"$f":"\"[pt]\"&E248","v":"[pt]-"},{"$f":"\"[gr]\"&E248","v":"[gr]-"}]
[null,"A3",null,{"$f":"HLOOKUP($C$1,$E$1:$X$4910,ROW(D249))","v":"The weighting of this theme is dependent on the environmental effect of the supplier's sector (see sheet “Industry\")."},"Die Gewichtung dieses Thema’s ist abhängig vom ökologischen Effekt der Branche des Lieferanten (siehe Tabellenblatt “Industry”)","La ponderazione di questo tema dipende dall'effetto ecologico dell'impresa del fornitore (vedi foglio \"impresa\")","The weighting of this theme is dependent on the environmental effect of the supplier's sector (see sheet “Industry\").","La ponderación de este tema depende de los impactos medioambientales del sector al que pertenecen sus proveedores (veáse la hoja “Industry”)",{"$f":"\"[fr]\"&E249","v":"[fr]Die Gewichtung dieses Thema’s ist abhängig vom ökologischen Effekt der Branche des Lieferanten (siehe Tabellenblatt “Industry”)"},{"$f":"\"[pt]\"&E249","v":"[pt]Die Gewichtung dieses Thema’s ist abhängig vom ökologischen Effekt der Branche des Lieferanten (siehe Tabellenblatt “Industry”)"},{"$f":"\"[gr]\"&E249","v":"[gr]Die Gewichtung dieses Thema’s ist abhängig vom ökologischen Effekt der Branche des Lieferanten (siehe Tabellenblatt “Industry”)"}]
[null,"A4",null,{"$f":"HLOOKUP($C$1,$E$1:$X$4910,ROW(D250))","v":"The weighting of this theme is dependent on co-determination rights in the countries of the most important supply industries (based on the ILUC index of the International Labour Union)."},"Die Gewichtung dieses Thema’s ist abhängig von den Mitbestimmungsrechte in den Ländern der wichtigsten Zulieferbranchen (basierend auf dem ITUC-Index der International Trade Union Confederation)","La ponderazione di questo tema dipende dai diritti di partecipazione nei paesi dei settori di approvvigionamento più importanti (in base alla CSI-indice della Confederazione internazionale dei sindacati)","The weighting of this theme is dependent on co-determination rights in the countries of the most important supply industries (based on the ILUC index of the International Labour Union).","La ponderación de este tema depende de los derechos de participación democrática en los países de los proveedores más importantes (basado en el índice que elabora la confederación sindical internacional ITUC)",{"$f":"\"[fr]\"&E250","v":"[fr]Die Gewichtung dieses Thema’s ist abhängig von den Mitbestimmungsrechte in den Ländern der wichtigsten Zulieferbranchen (basierend auf dem ITUC-Index der International Trade Union Confederation)"},{"$f":"\"[pt]\"&E250","v":"[pt]Die Gewichtung dieses Thema’s ist abhängig von den Mitbestimmungsrechte in den Ländern der wichtigsten Zulieferbranchen (basierend auf dem ITUC-Index der International Trade Union Confederation)"},{"$f":"\"[gr]\"&E250","v":"[gr]Die Gewichtung dieses Thema’s ist abhängig von den Mitbestimmungsrechte in den Ländern der wichtigsten Zulieferbranchen (basierend auf dem ITUC-Index der International Trade Union Confederation)"}]
[null,"B1",null,{"$f":"HLOOKUP($C$1,$E$1:$X$4910,ROW(D251))","v":"The weighting of this theme depends on the ratio turnover to the balance sheet total."},"Die Gewichtung dieses Thema’s ist abhängig von der Relation Umsatz zu Bilanzsumme","La ponderazione di questo argomento dipende dalla relazione tra fatturato e totale del bilancio","The weighting of this theme depends on the ratio turnover to the balance sheet total.","La ponderación de este tema depende del cociente Facturación / Balance (financiero)",{"$f":"\"[fr]\"&E251","v":"[fr]Die Gewichtung dieses Thema’s ist abhängig von der Relation Umsatz zu Bilanzsumme"},{"$f":"\"[pt]\"&E251","v":"[pt]Die Gewichtung dieses Thema’s ist abhängig von der Relation Umsatz zu Bilanzsumme"},{"$f":"\"[gr]\"&E251","v":"[gr]Die Gewichtung dieses Thema’s ist abhängig von der Relation Umsatz zu Bilanzsumme"}]
[null,"B2",null,{"$f":"HLOOKUP($C$1,$E$1:$X$4910,ROW(D252))","v":"The weighting of this theme depends on the ratio profit to turnover"},"Die Gewichtung dieses Thema’s ist abhängig von der Relation Gewinn zu Umsatz ","La ponderazione di questo argomento dipende dalla relazione tra utile e fatturato","The weighting of this theme depends on the ratio profit to turnover","La ponderación de este tema depende del cociente beneficio neto / facturación ",{"$f":"\"[fr]\"&E252","v":"[fr]Die Gewichtung dieses Thema’s ist abhängig von der Relation Gewinn zu Umsatz"},{"$f":"\"[pt]\"&E252","v":"[pt]Die Gewichtung dieses Thema’s ist abhängig von der Relation Gewinn zu Umsatz"},{"$f":"\"[gr]\"&E252","v":"[gr]Die Gewichtung dieses Thema’s ist abhängig von der Relation Gewinn zu Umsatz"}]
[null,"B3",null,{"$f":"HLOOKUP($C$1,$E$1:$X$4910,ROW(D253))","v":"The weighting of this theme is dependent on additions to fixed-assets and financial assets in relation to the balance sheet total."},"Die Gewichtung dieses Thema’s ist abhängig  Zugängen zum Anlagevermögen und Finanzvermögen in Relation zu der Bilanzsumme","La ponderazione di questo tema dipende dalle aggiunte alle attività e alle attività finanziarie in relazione al totale del bilancio","The weighting of this theme is dependent on additions to fixed-assets and financial assets in relation to the balance sheet total.","La ponderación de este tema depende del cociente de las altas de activos fijos y financieros en relación al balance (financiero)",{"$f":"\"[fr]\"&E253","v":"[fr]Die Gewichtung dieses Thema’s ist abhängig  Zugängen zum Anlagevermögen und Finanzvermögen in Relation zu der Bilanzsumme"},{"$f":"\"[pt]\"&E253","v":"[pt]Die Gewichtung dieses Thema’s ist abhängig  Zugängen zum Anlagevermögen und Finanzvermögen in Relation zu der Bilanzsumme"},{"$f":"\"[gr]\"&E253","v":"[gr]Die Gewichtung dieses Thema’s ist abhängig  Zugängen zum Anlagevermögen und Finanzvermögen in Relation zu der Bilanzsumme"}]
[null,"B4",null,{"$f":"HLOOKUP($C$1,$E$1:$X$4910,ROW(D254))","v":"The weighting of this theme is dependent on the size of the company."},"Die Gewichtung dieses Thema’s ist abhängig von der Größe des Unternehmens","La ponderazione di questo tema dipende dalle dimensioni dell'impresa","The weighting of this theme is dependent on the size of the company.","La ponderación de este tema depende del tamaño de la empresa",{"$f":"\"[fr]\"&E254","v":"[fr]Die Gewichtung dieses Thema’s ist abhängig von der Größe des Unternehmens"},{"$f":"\"[pt]\"&E254","v":"[pt]Die Gewichtung dieses Thema’s ist abhängig von der Größe des Unternehmens"},{"$f":"\"[gr]\"&E254","v":"[gr]Die Gewichtung dieses Thema’s ist abhängig von der Größe des Unternehmens"}]
[null,"C1",null,{"$f":"HLOOKUP($C$1,$E$1:$X$4910,ROW(D255))","v":"-"},"-","-","-","-",{"$f":"\"[fr]\"&E255","v":"[fr]-"},{"$f":"\"[pt]\"&E255","v":"[pt]-"},{"$f":"\"[gr]\"&E255","v":"[gr]-"}]
[null,"C2",null,{"$f":"HLOOKUP($C$1,$E$1:$X$4910,ROW(D256))","v":"-"},"-","-","-","-",{"$f":"\"[fr]\"&E256","v":"[fr]-"},{"$f":"\"[pt]\"&E256","v":"[pt]-"},{"$f":"\"[gr]\"&E256","v":"[gr]-"}]
[null,"C3",null,{"$f":"HLOOKUP($C$1,$E$1:$X$4910,ROW(D257))","v":"The weighting of this theme is dependent on the existence of a canteen for most of the employees as well as an (estimated) average commute to work."},"Die Gewichtung dieses Thema’s ist abhängig von der Existenz einer Kantine für die Mehrheit der Mitarbeiter*innen sowie dem (geschätzten) durchschnittlichen Anfahrtsweg zur Arbeit.","La ponderazione di questo tema dipende dall'esistenza di una mensa per la maggior parte dei dipendenti e dal viaggio medio (stimato) fino al lavoro.","The weighting of this theme is dependent on the existence of a canteen for most of the employees as well as an (estimated) average commute to work. ","La ponderación de este tema depende de si la empresa tiene cantina a disposición de la mayoría de los trabajadores así como del trayecto medio (estimado) al puesto de trabajo.",{"$f":"\"[fr]\"&E257","v":"[fr]Die Gewichtung dieses Thema’s ist abhängig von der Existenz einer Kantine für die Mehrheit der Mitarbeiter*innen sowie dem (geschätzten) durchschnittlichen Anfahrtsweg zur Arbeit."},{"$f":"\"[pt]\"&E257","v":"[pt]Die Gewichtung dieses Thema’s ist abhängig von der Existenz einer Kantine für die Mehrheit der Mitarbeiter*innen sowie dem (geschätzten) durchschnittlichen Anfahrtsweg zur Arbeit."},{"$f":"\"[gr]\"&E257","v":"[gr]Die Gewichtung dieses Thema’s ist abhängig von der Existenz einer Kantine für die Mehrheit der Mitarbeiter*innen sowie dem (geschätzten) durchschnittlichen Anfahrtsweg zur Arbeit."}]
[null,"C4",null,{"$f":"HLOOKUP($C$1,$E$1:$X$4910,ROW(D258))","v":"The weighting of this theme is dependent on company size and co-determination rights in the countries of the most important supply industries (based on the ILUC index of the International Labour Union)."},"Die Gewichtung dieses Thema’s ist abhängig von der Größe des Unternehmens sowie von den Mitbestimmungsrechte in den Ländern der wichtigsten Standorte (basierend auf dem ITUC-Index der International Labour Union)","La ponderazione di questo tema dipende dalle dimensioni dell'impresa e dai diritti di partecipazione nei paesi delle sedi più importanti (in base all'indice ITUC dell'International Labour Union)","The weighting of this theme is dependent on company size and co-determination rights in the countries of the most important supply industries (based on the ILUC index of the International Labour Union).","La ponderación de este tema depende tanto del tamaño de la empresa como de los derechos de participación democrática en los países más importantes donde se encuentra la empresa presente (basado en el índice que elabora la confederación internacional sindical ITUC)",{"$f":"\"[fr]\"&E258","v":"[fr]Die Gewichtung dieses Thema’s ist abhängig von der Größe des Unternehmens sowie von den Mitbestimmungsrechte in den Ländern der wichtigsten Standorte (basierend auf dem ITUC-Index der International Labour Union)"},{"$f":"\"[pt]\"&E258","v":"[pt]Die Gewichtung dieses Thema’s ist abhängig von der Größe des Unternehmens sowie von den Mitbestimmungsrechte in den Ländern der wichtigsten Standorte (basierend auf dem ITUC-Index der International Labour Union)"},{"$f":"\"[gr]\"&E258","v":"[gr]Die Gewichtung dieses Thema’s ist abhängig von der Größe des Unternehmens sowie von den Mitbestimmungsrechte in den Ländern der wichtigsten Standorte (basierend auf dem ITUC-Index der International Labour Union)"}]
[null,"D1",null,{"$f":"HLOOKUP($C$1,$E$1:$X$4910,ROW(D259))","v":"-"},"-","-","-","-",{"$f":"\"[fr]\"&E259","v":"[fr]-"},{"$f":"\"[pt]\"&E259","v":"[pt]-"},{"$f":"\"[gr]\"&E259","v":"[gr]-"}]
[null,"D2",null,{"$f":"HLOOKUP($C$1,$E$1:$X$4910,ROW(D260))","v":"-"},"-","-","-","-",{"$f":"\"[fr]\"&E260","v":"[fr]-"},{"$f":"\"[pt]\"&E260","v":"[pt]-"},{"$f":"\"[gr]\"&E260","v":"[gr]-"}]
[null,"D3",null,{"$f":"HLOOKUP($C$1,$E$1:$X$4910,ROW(D261))","v":"The weighting of this theme depends on the industry sector."},"Die Gewichtung dieses Thema’s ist abhängig von der Branche ","La ponderazione di questo tema dipende dal settore","The weighting of this theme depends on the industry sector.","La ponderación de este tema depende del sector de la empresa",{"$f":"\"[fr]\"&E261","v":"[fr]Die Gewichtung dieses Thema’s ist abhängig von der Branche"},{"$f":"\"[pt]\"&E261","v":"[pt]Die Gewichtung dieses Thema’s ist abhängig von der Branche"},{"$f":"\"[gr]\"&E261","v":"[gr]Die Gewichtung dieses Thema’s ist abhängig von der Branche"}]
[null,"D4",null,{"$f":"HLOOKUP($C$1,$E$1:$X$4910,ROW(D262))","v":"The weighting of this theme depends on whether customers are primarily individuals or companies."},"Die Gewichtung dieses Thema’s ist abhängig davon, ob Kund*innen in erster Linie Private oder Unternehmen sind","La ponderazione di questo tema dipende dal fatto che i clienti siano principalmente privati o imprese","The weighting of this theme depends on whether customers are primarily individuals or companies.","La ponderación de este tema depende de si la empresa es principalmente B2B o B2C",{"$f":"\"[fr]\"&E262","v":"[fr]Die Gewichtung dieses Thema’s ist abhängig davon, ob Kund*innen in erster Linie Private oder Unternehmen sind"},{"$f":"\"[pt]\"&E262","v":"[pt]Die Gewichtung dieses Thema’s ist abhängig davon, ob Kund*innen in erster Linie Private oder Unternehmen sind"},{"$f":"\"[gr]\"&E262","v":"[gr]Die Gewichtung dieses Thema’s ist abhängig davon, ob Kund*innen in erster Linie Private oder Unternehmen sind"}]
[null,"E1",null,{"$f":"HLOOKUP($C$1,$E$1:$X$4910,ROW(D263))","v":"-"},"-","-","-","-",{"$f":"\"[fr]\"&E263","v":"[fr]-"},{"$f":"\"[pt]\"&E263","v":"[pt]-"},{"$f":"\"[gr]\"&E263","v":"[gr]-"}]
[null,"E2",null,{"$f":"HLOOKUP($C$1,$E$1:$X$4910,ROW(D264))","v":"The weighting of this theme is dependent on the return on sales (profit/turnover)."},"Die Gewichtung dieses Thema’s ist abhängig von der Umsatzrentabilität (Gewinn/Umsatz)","La ponderazione di questo tema dipende dal rendimento delle vendite (profitti / fatturato)","The weighting of this theme is dependent on the return on sales (profit/turnover).","La ponderación de este tema depende de la rentabilidad de la empresa entendida como Beneficios / Facturación",{"$f":"\"[fr]\"&E264","v":"[fr]Die Gewichtung dieses Thema’s ist abhängig von der Umsatzrentabilität (Gewinn/Umsatz)"},{"$f":"\"[pt]\"&E264","v":"[pt]Die Gewichtung dieses Thema’s ist abhängig von der Umsatzrentabilität (Gewinn/Umsatz)"},{"$f":"\"[gr]\"&E264","v":"[gr]Die Gewichtung dieses Thema’s ist abhängig von der Umsatzrentabilität (Gewinn/Umsatz)"}]
[null,"E3",null,{"$f":"HLOOKUP($C$1,$E$1:$X$4910,ROW(D265))","v":"The weighting of this theme depends on the industry sector."},"Die Gewichtung dieses Thenma’s ist abhängig von der Branche","La ponderazione di questo tema dipende dal settore","The weighting of this theme depends on the industry sector.","La ponderación de este tema depende del sector de la empresa",{"$f":"\"[fr]\"&E265","v":"[fr]Die Gewichtung dieses Thenma’s ist abhängig von der Branche"},{"$f":"\"[pt]\"&E265","v":"[pt]Die Gewichtung dieses Thenma’s ist abhängig von der Branche"},{"$f":"\"[gr]\"&E265","v":"[gr]Die Gewichtung dieses Thenma’s ist abhängig von der Branche"}]
[null,"E4",null,{"$f":"HLOOKUP($C$1,$E$1:$X$4910,ROW(D266))","v":"The weighting of this theme depends on the company size and the industry sector."},"Die Gewichtung dieses Thema’s ist abhängig von der Größe sowie der Branche des Unternehmens.","La ponderazione di questo tema dipende dalle dimensioni sia del settore che dell’impresa.","The weighting of this theme depends on the company size and the industry sector.","La ponderación de este tema depende tanto del tamaño de la empresa como del sector.",{"$f":"\"[fr]\"&E266","v":"[fr]Die Gewichtung dieses Thema’s ist abhängig von der Größe sowie der Branche des Unternehmens."},{"$f":"\"[pt]\"&E266","v":"[pt]Die Gewichtung dieses Thema’s ist abhängig von der Größe sowie der Branche des Unternehmens."},{"$f":"\"[gr]\"&E266","v":"[gr]Die Gewichtung dieses Thema’s ist abhängig von der Größe sowie der Branche des Unternehmens."}]
[{"$nulls":3},{"$f":"HLOOKUP($C$1,$E$1:$X$4910,ROW(D267))","v":0},{"$nulls":4},{"$f":"\"[fr]\"&E267","v":"[fr]"},{"$f":"\"[pt]\"&E267","v":"[pt]"},{"$f":"\"[gr]\"&E267","v":"[gr]"}]
[{"$nulls":3},{"$f":"HLOOKUP($C$1,$E$1:$X$4910,ROW(D268))","v":"A - agriculture, forestry management, fishing industry"},"A - Landwirtschaft, Forstwirtschaft und Fischerei","A-AGRICOLTURA, SILVICOLTURA E PESCA","A - agriculture, forestry management, fishing industry","A – Agricultura, silvicultura y pesca",{"$f":"\"[fr]\"&E268","v":"[fr]A - Landwirtschaft, Forstwirtschaft und Fischerei"},{"$f":"\"[pt]\"&E268","v":"[pt]A - Landwirtschaft, Forstwirtschaft und Fischerei"},{"$f":"\"[gr]\"&E268","v":"[gr]A - Landwirtschaft, Forstwirtschaft und Fischerei"}]
[{"$nulls":3},{"$f":"HLOOKUP($C$1,$E$1:$X$4910,ROW(D269))","v":"B - Mining and quarrying"},"B - Bergbau und Gewinnung von Steinen und Erden","B-ATTIVITÀ ESTRATTIVA","B - Mining and quarrying","B – Explotación de minas y canteras",{"$f":"\"[fr]\"&E269","v":"[fr]B - Bergbau und Gewinnung von Steinen und Erden"},{"$f":"\"[pt]\"&E269","v":"[pt]B - Bergbau und Gewinnung von Steinen und Erden"},{"$f":"\"[gr]\"&E269","v":"[gr]B - Bergbau und Gewinnung von Steinen und Erden"}]
[{"$nulls":3},{"$f":"HLOOKUP($C$1,$E$1:$X$4910,ROW(D270))","v":"C - Manufacturing industries (not further specified)"},"C - Verarbeitendes Gewerbe (nicht weiter spezifiziert)","C-ATTIVITÀ MANIFATTURIERE","C - Manufacturing industries (not further specified)","C – Indutrias manufactureras",{"$f":"\"[fr]\"&E270","v":"[fr]C - Verarbeitendes Gewerbe (nicht weiter spezifiziert)"},{"$f":"\"[pt]\"&E270","v":"[pt]C - Verarbeitendes Gewerbe (nicht weiter spezifiziert)"},{"$f":"\"[gr]\"&E270","v":"[gr]C - Verarbeitendes Gewerbe (nicht weiter spezifiziert)"}]
[{"$nulls":3},{"$f":"HLOOKUP($C$1,$E$1:$X$4910,ROW(D271))","v":"Ca - Food production, drinks and tobacco (C10, C11, C12)"},"Ca - Produktion von Lebensmittel, Getränken und Tabak (C10,C11,C12)","Ca-Prodotti di alimenti e bevande","Ca - Food production, drinks and tobacco (C10, C11, C12)","Ca – Industria de alimentación, bebidas y tabaco (C10, C11, C12)",{"$f":"\"[fr]\"&E271","v":"[fr]Ca - Produktion von Lebensmittel, Getränken und Tabak (C10,C11,C12)"},{"$f":"\"[pt]\"&E271","v":"[pt]Ca - Produktion von Lebensmittel, Getränken und Tabak (C10,C11,C12)"},{"$f":"\"[gr]\"&E271","v":"[gr]Ca - Produktion von Lebensmittel, Getränken und Tabak (C10,C11,C12)"}]
[{"$nulls":3},{"$f":"HLOOKUP($C$1,$E$1:$X$4910,ROW(D272))","v":"Cb - Textile production, clothing, leather and leather products (C13, C14, C15)"},"Cb - Produktion von Textilien, Kleidung, Leder und Produkten hieraus (C13,C14,C15)","Cb-Prodotti di tessuti, vestiti, cuoio","Cb - Textile production, clothing, leather and leather products (C13, C14, C15)","Cb – Industria textil, prendas de vestir, cuero y calzado (C13, C14, C15)",{"$f":"\"[fr]\"&E272","v":"[fr]Cb - Produktion von Textilien, Kleidung, Leder und Produkten hieraus (C13,C14,C15)"},{"$f":"\"[pt]\"&E272","v":"[pt]Cb - Produktion von Textilien, Kleidung, Leder und Produkten hieraus (C13,C14,C15)"},{"$f":"\"[gr]\"&E272","v":"[gr]Cb - Produktion von Textilien, Kleidung, Leder und Produkten hieraus (C13,C14,C15)"}]
[{"$nulls":3},{"$f":"HLOOKUP($C$1,$E$1:$X$4910,ROW(D273))","v":"Cc - Paper and forest products, also printed matter (C16, C17, C18)"},"Cc - Produktion von Holz- und Papierprodukten sowie Drucksorten (C16,C17,C18)","Cc-Prodotti di legno e carta (C16,C17,C18)","Cc - Paper and forest products, also printed matter (C16, C17, C18)","Cc – Industria de la madera y el corcho; cestería y espartería; papel; artes gráficas y reproducción de soportes grabados",{"$f":"\"[fr]\"&E273","v":"[fr]Cc - Produktion von Holz- und Papierprodukten sowie Drucksorten (C16,C17,C18)"},{"$f":"\"[pt]\"&E273","v":"[pt]Cc - Produktion von Holz- und Papierprodukten sowie Drucksorten (C16,C17,C18)"},{"$f":"\"[gr]\"&E273","v":"[gr]Cc - Produktion von Holz- und Papierprodukten sowie Drucksorten (C16,C17,C18)"}]
[{"$nulls":3},{"$f":"HLOOKUP($C$1,$E$1:$X$4910,ROW(D274))","v":"Cd - Production of petrochemical products and plastics (C19, C20;C22)"},"Cd - Produktion von petrochemischen Produkte und Kunststoffen (C19, C20;C22)","Cd-Prodotti petrol-sintetici e plastica (C19, C20;C22)","Cd - Production of petrochemical products and plastics (C19, C20;C22)","Cd – Industria química; coquerías y refino de petróleo; fabricación de productos de caucho y plásticos (C19, C20, C22)",{"$f":"\"[fr]\"&E274","v":"[fr]Cd - Produktion von petrochemischen Produkte und Kunststoffen (C19, C20;C22)"},{"$f":"\"[pt]\"&E274","v":"[pt]Cd - Produktion von petrochemischen Produkte und Kunststoffen (C19, C20;C22)"},{"$f":"\"[gr]\"&E274","v":"[gr]Cd - Produktion von petrochemischen Produkte und Kunststoffen (C19, C20;C22)"}]
[{"$nulls":3},{"$f":"HLOOKUP($C$1,$E$1:$X$4910,ROW(D275))","v":"Ce - Pharmaceutical products and preparations (C21)"},"Ce - Produktion von pharmazeutischen Produktion und Präparaten (C21)","Ce-Prodotti farmaceutici e medicinali (C21)","Ce - Pharmaceutical products and preparations (C21)","Ce – Fabricación de productos farmacéuticos (C21)",{"$f":"\"[fr]\"&E275","v":"[fr]Ce - Produktion von pharmazeutischen Produktion und Präparaten (C21)"},{"$f":"\"[pt]\"&E275","v":"[pt]Ce - Produktion von pharmazeutischen Produktion und Präparaten (C21)"},{"$f":"\"[gr]\"&E275","v":"[gr]Ce - Produktion von pharmazeutischen Produktion und Präparaten (C21)"}]
[{"$nulls":3},{"$f":"HLOOKUP($C$1,$E$1:$X$4910,ROW(D276))","v":"Cf - Production of non-metallic minerals (C23)"},"Cf - Produktion nicht metallischer Mineralstoffe (C23)","Cf-Prodotti non metallici e minerali (C23)","Cf - Production of non-metallic minerals (C23)","Cf – Fabricación de otros productos minerales no metálicos (C23)",{"$f":"\"[fr]\"&E276","v":"[fr]Cf - Produktion nicht metallischer Mineralstoffe (C23)"},{"$f":"\"[pt]\"&E276","v":"[pt]Cf - Produktion nicht metallischer Mineralstoffe (C23)"},{"$f":"\"[gr]\"&E276","v":"[gr]Cf - Produktion nicht metallischer Mineralstoffe (C23)"}]
[{"$nulls":3},{"$f":"HLOOKUP($C$1,$E$1:$X$4910,ROW(D277))","v":"Cg - Production of metal and metallic products (excl. machines and equipment) (C24, C25)"},"Cg - Produktion von Metallen und metallischen Produkten (exkl. Maschinen und Geräten) (C24,C25)","Cg-Prodotti di metalli","Cg - Production of metal and metallic products (excl. machines and equipment) (C24, C25)","Cg – Metalurgia; fabricación de productos de hierro, acero y ferroaleaciones; fabricación de productos metálicos, excepto maquinaria (C24, C25)",{"$f":"\"[fr]\"&E277","v":"[fr]Cg - Produktion von Metallen und metallischen Produkten (exkl. Maschinen und Geräten) (C24,C25)"},{"$f":"\"[pt]\"&E277","v":"[pt]Cg - Produktion von Metallen und metallischen Produkten (exkl. Maschinen und Geräten) (C24,C25)"},{"$f":"\"[gr]\"&E277","v":"[gr]Cg - Produktion von Metallen und metallischen Produkten (exkl. Maschinen und Geräten) (C24,C25)"}]
[{"$nulls":3},{"$f":"HLOOKUP($C$1,$E$1:$X$4910,ROW(D278))","v":"Ch - Production of electronic equipment, instruments and components as well as computers (C26, C27, C28)"},"Ch - Produktion von elektronischen, optischen und sonstigen Geräten und Bauteilen sowie Computer (C26,C27,C28)","Ch-Prodotti elettronici ed elettrici (C26,C27,C28)","Ch - Production of electronic equipment, instruments and components as well as computers (C26, C27, C28)","Ch – Fabricación de productos informáticos, electrónicos y ópticos; fabricación de material y equipo eléctrico; fabricación de maquinaria y equipo (C26, C27, C28)",{"$f":"\"[fr]\"&E278","v":"[fr]Ch - Produktion von elektronischen, optischen und sonstigen Geräten und Bauteilen sowie Computer (C26,C27,C28)"},{"$f":"\"[pt]\"&E278","v":"[pt]Ch - Produktion von elektronischen, optischen und sonstigen Geräten und Bauteilen sowie Computer (C26,C27,C28)"},{"$f":"\"[gr]\"&E278","v":"[gr]Ch - Produktion von elektronischen, optischen und sonstigen Geräten und Bauteilen sowie Computer (C26,C27,C28)"}]
[{"$nulls":3},{"$f":"HLOOKUP($C$1,$E$1:$X$4910,ROW(D279))","v":"D - Electric, Gas, Steam and Refrigeration"},"D - Strom-, Gas-, Dampfversorgung und Kühlung ","D-FORNITURA DI ENERGIA ELETTRICA, GAS, VAPORE E ARIA CONDIZIONATA","D - Electric, Gas, Steam and Refrigeration","D – Suministro de electricidad, gas, vapor y aire acondicionado",{"$f":"\"[fr]\"&E279","v":"[fr]D - Strom-, Gas-, Dampfversorgung und Kühlung"},{"$f":"\"[pt]\"&E279","v":"[pt]D - Strom-, Gas-, Dampfversorgung und Kühlung"},{"$f":"\"[gr]\"&E279","v":"[gr]D - Strom-, Gas-, Dampfversorgung und Kühlung"}]
[{"$nulls":3},{"$f":"HLOOKUP($C$1,$E$1:$X$4910,ROW(D280))","v":"E - Water supply, waste management"},"E - Wasserversorgung, Abfallwirtschaft","E-FORNITURA DI ACQUA; RETI FOGNARIE, ATTIVITÀ DI TRATTAMENTO DEI RIFIUTI E RISANAMENTO","E - Water supply, waste management","E – Suministro de agua, alcantarillado, gestión de desechos y actividades de saneamiento",{"$f":"\"[fr]\"&E280","v":"[fr]E - Wasserversorgung, Abfallwirtschaft"},{"$f":"\"[pt]\"&E280","v":"[pt]E - Wasserversorgung, Abfallwirtschaft"},{"$f":"\"[gr]\"&E280","v":"[gr]E - Wasserversorgung, Abfallwirtschaft"}]
[{"$nulls":3},{"$f":"HLOOKUP($C$1,$E$1:$X$4910,ROW(D281))","v":"F - Construction industry"},"F - Baugewerbe","F-Costruzioni","F - Construction industry","F – Construcción",{"$f":"\"[fr]\"&E281","v":"[fr]F - Baugewerbe"},{"$f":"\"[pt]\"&E281","v":"[pt]F - Baugewerbe"},{"$f":"\"[gr]\"&E281","v":"[gr]F - Baugewerbe"}]
[{"$nulls":3},{"$f":"HLOOKUP($C$1,$E$1:$X$4910,ROW(D282))","v":"G - Wholesale and retail"},"G - Groß- und Einzelhandel sowie Werkstätten für Kraftfahrzeuge (Anmerkung: Groß- und Einzelhandel nicht auf KFZ beschränkt)","G-Commercio all'ingrosso e al dettaglio, officine","G - Wholesale and retail","G – Comercio al por mayor y al por menor, reparación de los vehículos de motor y de las motocicletas",{"$f":"\"[fr]\"&E282","v":"[fr]G - Groß- und Einzelhandel sowie Werkstätten für Kraftfahrzeuge (Anmerkung: Groß- und Einzelhandel nicht auf KFZ beschränkt)"},{"$f":"\"[pt]\"&E282","v":"[pt]G - Groß- und Einzelhandel sowie Werkstätten für Kraftfahrzeuge (Anmerkung: Groß- und Einzelhandel nicht auf KFZ beschränkt)"},{"$f":"\"[gr]\"&E282","v":"[gr]G - Groß- und Einzelhandel sowie Werkstätten für Kraftfahrzeuge (Anmerkung: Groß- und Einzelhandel nicht auf KFZ beschränkt)"}]
[{"$nulls":3},{"$f":"HLOOKUP($C$1,$E$1:$X$4910,ROW(D283))","v":"H - Transport and warehousing"},"H - Verkehr und Lagerhaltung","H-TRASPORTO E MAGAZZINAGGIO","H - Transport and warehousing","H – Transporte y almacenamiento",{"$f":"\"[fr]\"&E283","v":"[fr]H - Verkehr und Lagerhaltung"},{"$f":"\"[pt]\"&E283","v":"[pt]H - Verkehr und Lagerhaltung"},{"$f":"\"[gr]\"&E283","v":"[gr]H - Verkehr und Lagerhaltung"}]
[{"$nulls":3},{"$f":"HLOOKUP($C$1,$E$1:$X$4910,ROW(D284))","v":"I - Accommodation and catering"},"I - Beherbergung und Gastronomie","I-SERVIZI DI ALLOGGIO E DI RISTORAZIONE","I - Accommodation and catering","I – Alojamiento y servicios de comida",{"$f":"\"[fr]\"&E284","v":"[fr]I - Beherbergung und Gastronomie"},{"$f":"\"[pt]\"&E284","v":"[pt]I - Beherbergung und Gastronomie"},{"$f":"\"[gr]\"&E284","v":"[gr]I - Beherbergung und Gastronomie"}]
[{"$nulls":3},{"$f":"HLOOKUP($C$1,$E$1:$X$4910,ROW(D285))","v":"J - Information and Communication"},"J - Information und Kommunikation","J-SERVIZI DI INFORMAZIONE E COMUNICAZIONE","J - Information and Communication","J – Información y comunicación",{"$f":"\"[fr]\"&E285","v":"[fr]J - Information und Kommunikation"},{"$f":"\"[pt]\"&E285","v":"[pt]J - Information und Kommunikation"},{"$f":"\"[gr]\"&E285","v":"[gr]J - Information und Kommunikation"}]
[{"$nulls":3},{"$f":"HLOOKUP($C$1,$E$1:$X$4910,ROW(D286))","v":"K - Financial services"},"K - Kredit- und Finanzwesen","K-ATTIVITÀ FINANZIARIE E ASSICURATIVE","K - Financial services","K – Actividades financieras y de seguros",{"$f":"\"[fr]\"&E286","v":"[fr]K - Kredit- und Finanzwesen"},{"$f":"\"[pt]\"&E286","v":"[pt]K - Kredit- und Finanzwesen"},{"$f":"\"[gr]\"&E286","v":"[gr]K - Kredit- und Finanzwesen"}]
[{"$nulls":3},{"$f":"HLOOKUP($C$1,$E$1:$X$4910,ROW(D287))","v":"L - Real estate"},"L - (Immobilienwirtschaft","L-ATTIVITÀ IMMOBILIARI","L - Real estate","L – Actividades inmobiliarias",{"$f":"\"[fr]\"&E287","v":"[fr]L - (Immobilienwirtschaft"},{"$f":"\"[pt]\"&E287","v":"[pt]L - (Immobilienwirtschaft"},{"$f":"\"[gr]\"&E287","v":"[gr]L - (Immobilienwirtschaft"}]
[{"$nulls":3},{"$f":"HLOOKUP($C$1,$E$1:$X$4910,ROW(D288))","v":"M - Professional, technical and scientific services"},"M - Freiberufliche, wissenschaftliche und technische Dienstleistungen","M-ATTIVITÀ PROFESSIONALI, SCIENTIFICHE E TECNICHE","M - Professional, technical and scientific services","M – Actividades profesionales, científicas y técnicas",{"$f":"\"[fr]\"&E288","v":"[fr]M - Freiberufliche, wissenschaftliche und technische Dienstleistungen"},{"$f":"\"[pt]\"&E288","v":"[pt]M - Freiberufliche, wissenschaftliche und technische Dienstleistungen"},{"$f":"\"[gr]\"&E288","v":"[gr]M - Freiberufliche, wissenschaftliche und technische Dienstleistungen"}]
[{"$nulls":3},{"$f":"HLOOKUP($C$1,$E$1:$X$4910,ROW(D289))","v":"N - Administrative and support services"},"N - Administrative und unterstützende Dienstleistungen","N-ATTIVITÀ AMMINISTRATIVE E DI SERVIZI DI SUPPORTO","N - Administrative and support services","N – Actividades administrativas y servicios de apoyo",{"$f":"\"[fr]\"&E289","v":"[fr]N - Administrative und unterstützende Dienstleistungen"},{"$f":"\"[pt]\"&E289","v":"[pt]N - Administrative und unterstützende Dienstleistungen"},{"$f":"\"[gr]\"&E289","v":"[gr]N - Administrative und unterstützende Dienstleistungen"}]
[{"$nulls":3},{"$f":"HLOOKUP($C$1,$E$1:$X$4910,ROW(D290))","v":"O - Public administration; defence; social security"},"O - Öffentliche Verwaltung; Verteidigung; Sozialversicherungswesen","O-AMMINISTRAZIONE PUBBLICA E DIFESA; ASSICURAZIONE SOCIALE OBBLIGATORIA","O - Public administration; defence; social security","O – Administración pública y defensa, planes de seguridad social de afiliación obligatoria",{"$f":"\"[fr]\"&E290","v":"[fr]O - Öffentliche Verwaltung; Verteidigung; Sozialversicherungswesen"},{"$f":"\"[pt]\"&E290","v":"[pt]O - Öffentliche Verwaltung; Verteidigung; Sozialversicherungswesen"},{"$f":"\"[gr]\"&E290","v":"[gr]O - Öffentliche Verwaltung; Verteidigung; Sozialversicherungswesen"}]
[{"$nulls":3},{"$f":"HLOOKUP($C$1,$E$1:$X$4910,ROW(D291))","v":"P - Education"},"P - Bildung","P-ISTRUZIONE","P - Education","P – Enseñanza",{"$f":"\"[fr]\"&E291","v":"[fr]P - Bildung"},{"$f":"\"[pt]\"&E291","v":"[pt]P - Bildung"},{"$f":"\"[gr]\"&E291","v":"[gr]P - Bildung"}]
[{"$nulls":3},{"$f":"HLOOKUP($C$1,$E$1:$X$4910,ROW(D292))","v":"Q - Health and social work"},"Q - Gesundheit und Sozialarbeit","Q-SANITÀ E ASSISTENZA SOCIALE","Q - Health and social work","Q – Servicios sociales y relacionados con la salud humana",{"$f":"\"[fr]\"&E292","v":"[fr]Q - Gesundheit und Sozialarbeit"},{"$f":"\"[pt]\"&E292","v":"[pt]Q - Gesundheit und Sozialarbeit"},{"$f":"\"[gr]\"&E292","v":"[gr]Q - Gesundheit und Sozialarbeit"}]
[{"$nulls":3},{"$f":"HLOOKUP($C$1,$E$1:$X$4910,ROW(D293))","v":"R - Art, education and leisure"},"R - Kunst, Unterhaltung und Erholung","R-ATTIVITA' ARTISTICHE, DI INTRATTENIMENTO E DIVERTIMENTO","R - Art, education and leisure","R – Artes, entretenimiento y recreación",{"$f":"\"[fr]\"&E293","v":"[fr]R - Kunst, Unterhaltung und Erholung"},{"$f":"\"[pt]\"&E293","v":"[pt]R - Kunst, Unterhaltung und Erholung"},{"$f":"\"[gr]\"&E293","v":"[gr]R - Kunst, Unterhaltung und Erholung"}]
[{"$nulls":3},{"$f":"HLOOKUP($C$1,$E$1:$X$4910,ROW(D294))","v":"S - Other services"},"S - Andere Dienstleistungen","S-ALTRE ATTIVITÀ DI SERVIZI","S - Other services","S – Otras actividades de servicio",{"$f":"\"[fr]\"&E294","v":"[fr]S - Andere Dienstleistungen"},{"$f":"\"[pt]\"&E294","v":"[pt]S - Andere Dienstleistungen"},{"$f":"\"[gr]\"&E294","v":"[gr]S - Andere Dienstleistungen"}]
[{"$nulls":3},{"$f":"HLOOKUP($C$1,$E$1:$X$4910,ROW(D295))","v":"Please enter"},"T - Private Haushalte","T-convivenze, comunità famigliari e persone singole, condimini, amministratori di condomini","Please enter","T – Actividades de los hogares en calidad de empleadores, actividades indiferenciadas de producción de bienes y servicios de los hogares para uso propio",{"$f":"\"[fr]\"&E295","v":"[fr]T - Private Haushalte"},{"$f":"\"[pt]\"&E295","v":"[pt]T - Private Haushalte"},{"$f":"\"[gr]\"&E295","v":"[gr]T - Private Haushalte"}]
[{"$nulls":3},{"$f":"HLOOKUP($C$1,$E$1:$X$4910,ROW(D296))","v":"U - Extraterritorial organisations and bodies"},"U - Exterritoriale Organisationen und Körperschaften","U-ATTIVITÀ DI ORGANIZZAZIONI E ORGANISMI EXTRATERRITORIALI ","U - Extraterritorial organisations and bodies","U – Actividades de organizaciones y órganos extraterritoriales",{"$f":"\"[fr]\"&E296","v":"[fr]U - Exterritoriale Organisationen und Körperschaften"},{"$f":"\"[pt]\"&E296","v":"[pt]U - Exterritoriale Organisationen und Körperschaften"},{"$f":"\"[gr]\"&E296","v":"[gr]U - Exterritoriale Organisationen und Körperschaften"}]
[{"$nulls":3},{"$f":"HLOOKUP($C$1,$E$1:$X$4910,ROW(D297))","v":"Total purchases from suppliers (in Euros):"},"Gesamt-Ausgaben an Lieferanten (in Euro):","Spese totali per i fornitori (in euro):","Total purchases from suppliers (in Euros):","Gastos totales en proveedores (en Euros):",{"$f":"\"[fr]\"&E297","v":"[fr]Gesamt-Ausgaben an Lieferanten (in Euro):"},{"$f":"\"[pt]\"&E297","v":"[pt]Gesamt-Ausgaben an Lieferanten (in Euro):"},{"$f":"\"[gr]\"&E297","v":"[gr]Gesamt-Ausgaben an Lieferanten (in Euro):"}]
[{"$nulls":3},{"$f":"HLOOKUP($C$1,$E$1:$X$4910,ROW(D298))","v":"Enter the 5 most important industry sectors whose products or services you use."},"Tragen Sie nachstehend, bitte die 5 wichtigstenBranchen ein, aus denen Sie Produkte/Dienstleistungen beziehen. ","Inserisci sotto i 5 settori più importanti da cui acquisti prodotti / servizi.","Enter the 5 most important industry sectors whose products or services you use.","Introduzca los 5 secoters más importantes a los que realiza compras",{"$f":"\"[fr]\"&E298","v":"[fr]Tragen Sie nachstehend, bitte die 5 wichtigstenBranchen ein, aus denen Sie Produkte/Dienstleistungen beziehen."},{"$f":"\"[pt]\"&E298","v":"[pt]Tragen Sie nachstehend, bitte die 5 wichtigstenBranchen ein, aus denen Sie Produkte/Dienstleistungen beziehen."},{"$f":"\"[gr]\"&E298","v":"[gr]Tragen Sie nachstehend, bitte die 5 wichtigstenBranchen ein, aus denen Sie Produkte/Dienstleistungen beziehen."}]
[{"$nulls":3},{"$f":"HLOOKUP($C$1,$E$1:$X$4910,ROW(D299))","v":"Industry sector"},"Branche","Settore","Industry sector","Sector",{"$f":"\"[fr]\"&E299","v":"[fr]Branche"},{"$f":"\"[pt]\"&E299","v":"[pt]Branche"},{"$f":"\"[gr]\"&E299","v":"[gr]Branche"}]
[{"$nulls":3},{"$f":"HLOOKUP($C$1,$E$1:$X$4910,ROW(D300))","v":"Description"},"Beschreibung","Descrizione","Description","Descripción",{"$f":"\"[fr]\"&E300","v":"[fr]Beschreibung"},{"$f":"\"[pt]\"&E300","v":"[pt]Beschreibung"},{"$f":"\"[gr]\"&E300","v":"[gr]Beschreibung"}]
[{"$nulls":3},{"$f":"HLOOKUP($C$1,$E$1:$X$4910,ROW(D301))","v":"Region of origin"},"regionale Herkunft","Provenienza regionale","Region of origin","Región de origen",{"$f":"\"[fr]\"&E301","v":"[fr]regionale Herkunft"},{"$f":"\"[pt]\"&E301","v":"[pt]regionale Herkunft"},{"$f":"\"[gr]\"&E301","v":"[gr]regionale Herkunft"}]
[{"$nulls":3},{"$f":"HLOOKUP($C$1,$E$1:$X$4910,ROW(D302))","v":"Costs"},"Ausgaben","Spese","Costs","Gastos",{"$f":"\"[fr]\"&E302","v":"[fr]Ausgaben"},{"$f":"\"[pt]\"&E302","v":"[pt]Ausgaben"},{"$f":"\"[gr]\"&E302","v":"[gr]Ausgaben"}]
[{"$nulls":3},{"$f":"HLOOKUP($C$1,$E$1:$X$4910,ROW(D303))","v":"Main origin of the other suppliers"},"Überwiegende Herkunft restlicher Lieferanten","Provenienza principale degli altri fornitori","Main origin of the other suppliers","Región de origen principal del resto de proveedores",{"$f":"\"[fr]\"&E303","v":"[fr]Überwiegende Herkunft restlicher Lieferanten"},{"$f":"\"[pt]\"&E303","v":"[pt]Überwiegende Herkunft restlicher Lieferanten"},{"$f":"\"[gr]\"&E303","v":"[gr]Überwiegende Herkunft restlicher Lieferanten"}]
[{"$nulls":3},{"$f":"HLOOKUP($C$1,$E$1:$X$4910,ROW(D304))","v":"Profit"},"Gewinn (EBIT):","Profitto (EBIT):","Profit","Beneficios (EBIT)",{"$f":"\"[fr]\"&E304","v":"[fr]Gewinn (EBIT):"},{"$f":"\"[pt]\"&E304","v":"[pt]Gewinn (EBIT):"},{"$f":"\"[gr]\"&E304","v":"[gr]Gewinn (EBIT):"}]
[{"$nulls":3},{"$f":"HLOOKUP($C$1,$E$1:$X$4910,ROW(D305))","v":"Financing costs"},"Finanzierungskosten","oneri finanziari","Financing costs","Costes financieros",{"$f":"\"[fr]\"&E305","v":"[fr]Finanzierungskosten"},{"$f":"\"[pt]\"&E305","v":"[pt]Finanzierungskosten"},{"$f":"\"[gr]\"&E305","v":"[gr]Finanzierungskosten"}]
[{"$nulls":3},{"$f":"HLOOKUP($C$1,$E$1:$X$4910,ROW(D306))","v":"Income from financial investments"},"Erträge aus Finanzanlagen","Proventi da attività finanziarie","Income from financial investments","Ingresos financieros",{"$f":"\"[fr]\"&E306","v":"[fr]Erträge aus Finanzanlagen"},{"$f":"\"[pt]\"&E306","v":"[pt]Erträge aus Finanzanlagen"},{"$f":"\"[gr]\"&E306","v":"[gr]Erträge aus Finanzanlagen"}]
[{"$nulls":3},{"$f":"HLOOKUP($C$1,$E$1:$X$4910,ROW(D307))","v":"Total assets"},"Bilanzaktiva","attività stato patrimoniale","Total assets","Activo (balance financiero)",{"$f":"\"[fr]\"&E307","v":"[fr]Bilanzaktiva"},{"$f":"\"[pt]\"&E307","v":"[pt]Bilanzaktiva"},{"$f":"\"[gr]\"&E307","v":"[gr]Bilanzaktiva"}]
[{"$nulls":3},{"$f":"HLOOKUP($C$1,$E$1:$X$4910,ROW(D308))","v":"Additions to fixed-assets"},"Zugänge zum Anlagevermögen ","Aggiunte alle immobilizzazioni","Additions to fixed-assets","Altas de activos fijos",{"$f":"\"[fr]\"&E308","v":"[fr]Zugänge zum Anlagevermögen"},{"$f":"\"[pt]\"&E308","v":"[pt]Zugänge zum Anlagevermögen"},{"$f":"\"[gr]\"&E308","v":"[gr]Zugänge zum Anlagevermögen"}]
[{"$nulls":3},{"$f":"HLOOKUP($C$1,$E$1:$X$4910,ROW(D309))","v":"Financial assets and cash balance"},"Finanzanlagen und Barguthaben","Attività finanziarie e saldo di cassa","Financial assets and cash balance","Activos financieros y saldos de caja",{"$f":"\"[fr]\"&E309","v":"[fr]Finanzanlagen und Barguthaben"},{"$f":"\"[pt]\"&E309","v":"[pt]Finanzanlagen und Barguthaben"},{"$f":"\"[gr]\"&E309","v":"[gr]Finanzanlagen und Barguthaben"}]
[{"$nulls":3},{"$f":"HLOOKUP($C$1,$E$1:$X$4910,ROW(D310))","v":"Number of employees (full time equivalents)"},"Anzahl der Mitarbeitenden (in Vollzeitäquivalenten): ","Numero di collaboratori (in equivalenti a tempo pieno):","Number of employees (full time equivalents)","Cantidad de trabajadores (equivalentes a jornada completa)",{"$f":"\"[fr]\"&E310","v":"[fr]Anzahl der Mitarbeitenden (in Vollzeitäquivalenten):"},{"$f":"\"[pt]\"&E310","v":"[pt]Anzahl der Mitarbeitenden (in Vollzeitäquivalenten):"},{"$f":"\"[gr]\"&E310","v":"[gr]Anzahl der Mitarbeitenden (in Vollzeitäquivalenten):"}]
[{"$nulls":3},{"$f":"HLOOKUP($C$1,$E$1:$X$4910,ROW(D311))","v":"Staff costs (gross without employer contribution)"},"Personalkosten (brutto ohne Dienstgeberanteil)","Costi del personale (lordi senza contributo del datore di lavoro)","Staff costs (gross without employer contribution)","Gastos de personal",{"$f":"\"[fr]\"&E311","v":"[fr]Personalkosten (brutto ohne Dienstgeberanteil)"},{"$f":"\"[pt]\"&E311","v":"[pt]Personalkosten (brutto ohne Dienstgeberanteil)"},{"$f":"\"[gr]\"&E311","v":"[gr]Personalkosten (brutto ohne Dienstgeberanteil)"}]
[{"$nulls":3},{"$f":"HLOOKUP($C$1,$E$1:$X$4910,ROW(D312))","v":"Enter the 3 countries and regions where most of the staff are"},"Tragen Sie bitte nachstehend jene drei Länder und Regionen ein, wo die meisten Mitarbeitenden arbeiten","Inserisca sotto i tre paesi e le regioni in cui lavora la maggior parte dei collaboratori","Enter the 3 countries and regions where most of the staff are","Introduzca los 3 países y regiones de los que la mayoría de trabajadores provienen",{"$f":"\"[fr]\"&E312","v":"[fr]Tragen Sie bitte nachstehend jene drei Länder und Regionen ein, wo die meisten Mitarbeitenden arbeiten"},{"$f":"\"[pt]\"&E312","v":"[pt]Tragen Sie bitte nachstehend jene drei Länder und Regionen ein, wo die meisten Mitarbeitenden arbeiten"},{"$f":"\"[gr]\"&E312","v":"[gr]Tragen Sie bitte nachstehend jene drei Länder und Regionen ein, wo die meisten Mitarbeitenden arbeiten"}]
[{"$nulls":3},{"$f":"HLOOKUP($C$1,$E$1:$X$4910,ROW(D313))","v":"Country and region"},"Land & Region","Paese e Regione","Country and region","País y región",{"$f":"\"[fr]\"&E313","v":"[fr]Land & Region"},{"$f":"\"[pt]\"&E313","v":"[pt]Land & Region"},{"$f":"\"[gr]\"&E313","v":"[gr]Land & Region"}]
[{"$nulls":3},{"$f":"HLOOKUP($C$1,$E$1:$X$4910,ROW(D314))","v":"Amount in %"},"Anteil in % ","Percentulale %","Amount in %","Porcentaje %",{"$f":"\"[fr]\"&E314","v":"[fr]Anteil in %"},{"$f":"\"[pt]\"&E314","v":"[pt]Anteil in %"},{"$f":"\"[gr]\"&E314","v":"[gr]Anteil in %"}]
[{"$nulls":3},{"$f":"HLOOKUP($C$1,$E$1:$X$4910,ROW(D315))","v":"Average journey to work for staff (in km)"},"Durchschnittlicher Arbeitsweg der Mitarbeitenden (in km):","Distanza media al posto di lavoro dei collaboratori (in km):","Average journey to work for staff (in km)","Trayecto medio de los trabajadores a su lugar de trabajo (km):",{"$f":"\"[fr]\"&E315","v":"[fr]Durchschnittlicher Arbeitsweg der Mitarbeitenden (in km):"},{"$f":"\"[pt]\"&E315","v":"[pt]Durchschnittlicher Arbeitsweg der Mitarbeitenden (in km):"},{"$f":"\"[gr]\"&E315","v":"[gr]Durchschnittlicher Arbeitsweg der Mitarbeitenden (in km):"}]
[{"$nulls":3},{"$f":"HLOOKUP($C$1,$E$1:$X$4910,ROW(D316))","v":"Is there a canteen for the majority of staff?"},"Gibt es eine Kantine für die Mehrheit der Mitarbeitenden?","C'è una mensa per la maggior parte dei collaboratori?","Is there a canteen for the majority of staff?","¿Hay cantina para la mayoría de los trabajadores?",{"$f":"\"[fr]\"&E316","v":"[fr]Gibt es eine Kantine für die Mehrheit der Mitarbeitenden?"},{"$f":"\"[pt]\"&E316","v":"[pt]Gibt es eine Kantine für die Mehrheit der Mitarbeitenden?"},{"$f":"\"[gr]\"&E316","v":"[gr]Gibt es eine Kantine für die Mehrheit der Mitarbeitenden?"}]
[{"$nulls":3},{"$f":"HLOOKUP($C$1,$E$1:$X$4910,ROW(D317))","v":"Turnover (in Euros)"},"Umsatz (in Euro)","fatturato (in euro)","Turnover (in Euros)","Facturación (en euros)",{"$f":"\"[fr]\"&E317","v":"[fr]Umsatz (in Euro)"},{"$f":"\"[pt]\"&E317","v":"[pt]Umsatz (in Euro)"},{"$f":"\"[gr]\"&E317","v":"[gr]Umsatz (in Euro)"}]
[{"$nulls":3},{"$f":"HLOOKUP($C$1,$E$1:$X$4910,ROW(D318))","v":"Are your customers mainly other companies?"},"Haben Sie nahezu ausschließlich Unternehmen als Kunden","Ha aziende quasi esclusivamente come clienti?","Are your customers mainly other companies?","¿Sus clientes son en su mayoría empresas?",{"$f":"\"[fr]\"&E318","v":"[fr]Haben Sie nahezu ausschließlich Unternehmen als Kunden"},{"$f":"\"[pt]\"&E318","v":"[pt]Haben Sie nahezu ausschließlich Unternehmen als Kunden"},{"$f":"\"[gr]\"&E318","v":"[gr]Haben Sie nahezu ausschließlich Unternehmen als Kunden"}]
[{"$nulls":3},{"$f":"HLOOKUP($C$1,$E$1:$X$4910,ROW(D319))","v":"Enter the 3 most important industry sectors which your company is active in, including a rough share of turnover"},"Tragen Sie nachstehend, bitte die 3 wichtigsten Branchen ein, in denen Ihr Unternehmen tätig ist, inklusive ungefährem Umsatzanteil","Di seguito, descriva i 3 settori più importanti in cui opera la Sua azienda, inclusa la quota di fatturato approssimativa","Enter the 3 most important industry sectors which your company is active in, including a rough share of turnover","Introduzca los 3 sectores más importantes en los que opera su empresa incluyendo la facturación aprox. correspondiente",{"$f":"\"[fr]\"&E319","v":"[fr]Tragen Sie nachstehend, bitte die 3 wichtigsten Branchen ein, in denen Ihr Unternehmen tätig ist, inklusive ungefährem Umsatzanteil"},{"$f":"\"[pt]\"&E319","v":"[pt]Tragen Sie nachstehend, bitte die 3 wichtigsten Branchen ein, in denen Ihr Unternehmen tätig ist, inklusive ungefährem Umsatzanteil"},{"$f":"\"[gr]\"&E319","v":"[gr]Tragen Sie nachstehend, bitte die 3 wichtigsten Branchen ein, in denen Ihr Unternehmen tätig ist, inklusive ungefährem Umsatzanteil"}]
[{"$nulls":3},{"$f":"HLOOKUP($C$1,$E$1:$X$4910,ROW(D320))","v":"Industry sector"},"Branche","Settore","Industry sector","Sector",{"$f":"\"[fr]\"&E320","v":"[fr]Branche"},{"$f":"\"[pt]\"&E320","v":"[pt]Branche"},{"$f":"\"[gr]\"&E320","v":"[gr]Branche"}]
[{"$nulls":3},{"$f":"HLOOKUP($C$1,$E$1:$X$4910,ROW(D321))","v":"Description"},"Beschreibung","descrizione","Description","Descripción",{"$f":"\"[fr]\"&E321","v":"[fr]Beschreibung"},{"$f":"\"[pt]\"&E321","v":"[pt]Beschreibung"},{"$f":"\"[gr]\"&E321","v":"[gr]Beschreibung"}]
[{"$nulls":3},{"$f":"HLOOKUP($C$1,$E$1:$X$4910,ROW(D322))","v":"% Amount of total turnover"},"% Anteil am Gesamtumsatz","Quota % al fatturato","% Amount of total turnover","% sobre la facturación total",{"$f":"\"[fr]\"&E322","v":"[fr]% Anteil am Gesamtumsatz"},{"$f":"\"[pt]\"&E322","v":"[pt]% Anteil am Gesamtumsatz"},{"$f":"\"[gr]\"&E322","v":"[gr]% Anteil am Gesamtumsatz"}]
[{"$nulls":3},{"$f":"HLOOKUP($C$1,$E$1:$X$4910,ROW(D323))","v":"Company size"},"Unternehmensgrösse ","dimensioni dell'azienda","Company size","Tamaño de la empresa",{"$f":"\"[fr]\"&E323","v":"[fr]Unternehmensgrösse"},{"$f":"\"[pt]\"&E323","v":"[pt]Unternehmensgrösse"},{"$f":"\"[gr]\"&E323","v":"[gr]Unternehmensgrösse"}]
[{"$nulls":3},{"$f":"HLOOKUP($C$1,$E$1:$X$4910,ROW(D324))","v":"Micro-business"},"Kleinstunternehmen","microimpresa","Micro-business","Microempresa",{"$f":"\"[fr]\"&E324","v":"[fr]Kleinstunternehmen"},{"$f":"\"[pt]\"&E324","v":"[pt]Kleinstunternehmen"},{"$f":"\"[gr]\"&E324","v":"[gr]Kleinstunternehmen"}]
[{"$nulls":3},{"$f":"HLOOKUP($C$1,$E$1:$X$4910,ROW(D325))","v":"Small business"},"Kleinunternehmen","Piccola impresa","Small business","Pequeña empresa",{"$f":"\"[fr]\"&E325","v":"[fr]Kleinunternehmen"},{"$f":"\"[pt]\"&E325","v":"[pt]Kleinunternehmen"},{"$f":"\"[gr]\"&E325","v":"[gr]Kleinunternehmen"}]
[{"$nulls":3},{"$f":"HLOOKUP($C$1,$E$1:$X$4910,ROW(D326))","v":"Medium business"},"Mittleres Unternehmen","Impresa media","Medium business","Mediana empresa",{"$f":"\"[fr]\"&E326","v":"[fr]Mittleres Unternehmen"},{"$f":"\"[pt]\"&E326","v":"[pt]Mittleres Unternehmen"},{"$f":"\"[gr]\"&E326","v":"[gr]Mittleres Unternehmen"}]
[{"$nulls":3},{"$f":"HLOOKUP($C$1,$E$1:$X$4910,ROW(D327))","v":"Large business"},"Grossunternehmen","Grande impresa","Large business","Gran empresa",{"$f":"\"[fr]\"&E327","v":"[fr]Grossunternehmen"},{"$f":"\"[pt]\"&E327","v":"[pt]Grossunternehmen"},{"$f":"\"[gr]\"&E327","v":"[gr]Grossunternehmen"}]
[{"$nulls":3},{"$f":"HLOOKUP($C$1,$E$1:$X$4910,ROW(D328))","v":"[en]In diesem Tabellenblatt wird die Gemeinwohlbilanz berechnet."},"In diesem Tabellenblatt wird die Gemeinwohlbilanz berechnet. ","In questo foglio viene calcolato il punteggio del bilancio del bene comune.",{"$f":"\"[en]\"&E328","v":"[en]In diesem Tabellenblatt wird die Gemeinwohlbilanz berechnet."},"Introduzca descripción de la tabla: en esta hoja se calcula la puntuación del balance del Bien Común.",{"$f":"\"[fr]\"&E328","v":"[fr]In diesem Tabellenblatt wird die Gemeinwohlbilanz berechnet."},{"$f":"\"[pt]\"&E328","v":"[pt]In diesem Tabellenblatt wird die Gemeinwohlbilanz berechnet."},{"$f":"\"[gr]\"&E328","v":"[gr]In diesem Tabellenblatt wird die Gemeinwohlbilanz berechnet."}]
[{"$nulls":3},{"$f":"HLOOKUP($C$1,$E$1:$X$4910,ROW(D329))","v":"Introduce value between 0 and 10"},"Skalenwert eingeben: Wert muss im Bereich von 0 bis 10 liegen.","Inserisca un valore di scala da 0 a 10 ","Introduce value between 0 and 10","Introduzca puntuación. El valor debe encontrarse entre 0 y 10.",{"$f":"\"[fr]\"&E329","v":"[fr]Skalenwert eingeben: Wert muss im Bereich von 0 bis 10 liegen."},{"$f":"\"[pt]\"&E329","v":"[pt]Skalenwert eingeben: Wert muss im Bereich von 0 bis 10 liegen."},{"$f":"\"[gr]\"&E329","v":"[gr]Skalenwert eingeben: Wert muss im Bereich von 0 bis 10 liegen."}]
[{"$nulls":3},{"$f":"HLOOKUP($C$1,$E$1:$X$4910,ROW(D330))","v":"Introduce negative points between 0 and -200"},"Negativpunkte eingeben: Werte müssen im Bereich von -200 bis 0 liegen.","Inserisca un punteggio negativo da 0 a -200 ","Introduce negative points between 0 and -200","Introduzca puntuación negativa. El valor debe encontrarse entre -200 y 0.",{"$f":"\"[fr]\"&E330","v":"[fr]Negativpunkte eingeben: Werte müssen im Bereich von -200 bis 0 liegen."},{"$f":"\"[pt]\"&E330","v":"[pt]Negativpunkte eingeben: Werte müssen im Bereich von -200 bis 0 liegen."},{"$f":"\"[gr]\"&E330","v":"[gr]Negativpunkte eingeben: Werte müssen im Bereich von -200 bis 0 liegen."}]
[{"$nulls":3},{"$f":"HLOOKUP($C$1,$E$1:$X$4910,ROW(D331))","v":"[en]globaler Durchschnitt"},"globaler Durchschnitt","media globale",{"$f":"\"[en]\"&E331","v":"[en]globaler Durchschnitt"},"Media global",{"$f":"\"[fr]\"&E331","v":"[fr]globaler Durchschnitt"},{"$f":"\"[pt]\"&E331","v":"[pt]globaler Durchschnitt"},{"$f":"\"[gr]\"&E331","v":"[gr]globaler Durchschnitt"}]
[{"$nulls":3},{"$f":"HLOOKUP($C$1,$E$1:$X$4910,ROW(D332))","v":"Please choose"},"Bitte auswählen","Selezioni per favore","Please choose","Seleccione el país",{"$f":"\"[fr]\"&E332","v":"[fr]Bitte auswählen"},{"$f":"\"[pt]\"&E332","v":"[pt]Bitte auswählen"},{"$f":"\"[gr]\"&E332","v":"[gr]Bitte auswählen"}]
[{"$nulls":3},{"$f":"HLOOKUP($C$1,$E$1:$X$4910,ROW(D333))","v":"[en]Afrika"},"Afrika","Africa",{"$f":"\"[en]\"&E333","v":"[en]Afrika"},"África",{"$f":"\"[fr]\"&E333","v":"[fr]Afrika"},{"$f":"\"[pt]\"&E333","v":"[pt]Afrika"},{"$f":"\"[gr]\"&E333","v":"[gr]Afrika"}]
[{"$nulls":3},{"$f":"HLOOKUP($C$1,$E$1:$X$4910,ROW(D334))","v":"[en]Nord-Afrika und Mittlere Osten"},"Nord-Afrika und Mittlere Osten","Nord-Africa e Medio Oriente",{"$f":"\"[en]\"&E334","v":"[en]Nord-Afrika und Mittlere Osten"},"Norte de África y Oriente Medio",{"$f":"\"[fr]\"&E334","v":"[fr]Nord-Afrika und Mittlere Osten"},{"$f":"\"[pt]\"&E334","v":"[pt]Nord-Afrika und Mittlere Osten"},{"$f":"\"[gr]\"&E334","v":"[gr]Nord-Afrika und Mittlere Osten"}]
[{"$nulls":3},{"$f":"HLOOKUP($C$1,$E$1:$X$4910,ROW(D335))","v":"[en]Latein-Amerika"},"Latein-Amerika","Latino-America",{"$f":"\"[en]\"&E335","v":"[en]Latein-Amerika"},"Latinoamérica",{"$f":"\"[fr]\"&E335","v":"[fr]Latein-Amerika"},{"$f":"\"[pt]\"&E335","v":"[pt]Latein-Amerika"},{"$f":"\"[gr]\"&E335","v":"[gr]Latein-Amerika"}]
[{"$nulls":3},{"$f":"HLOOKUP($C$1,$E$1:$X$4910,ROW(D336))","v":"[en]Nord-Amerika & Ozeanien"},"Nord-Amerika & Ozeanien","Nord-America e Ozeania",{"$f":"\"[en]\"&E336","v":"[en]Nord-Amerika & Ozeanien"},"Norteamérica y Oceanía",{"$f":"\"[fr]\"&E336","v":"[fr]Nord-Amerika & Ozeanien"},{"$f":"\"[pt]\"&E336","v":"[pt]Nord-Amerika & Ozeanien"},{"$f":"\"[gr]\"&E336","v":"[gr]Nord-Amerika & Ozeanien"}]
[{"$nulls":3},{"$f":"HLOOKUP($C$1,$E$1:$X$4910,ROW(D337))","v":"[en]Asien"},"Asien","Asia",{"$f":"\"[en]\"&E337","v":"[en]Asien"},"Asia",{"$f":"\"[fr]\"&E337","v":"[fr]Asien"},{"$f":"\"[pt]\"&E337","v":"[pt]Asien"},{"$f":"\"[gr]\"&E337","v":"[gr]Asien"}]
[{"$nulls":3},{"$f":"HLOOKUP($C$1,$E$1:$X$4910,ROW(D338))","v":"[en]Europa"},"Europa","Europa",{"$f":"\"[en]\"&E338","v":"[en]Europa"},"Europa",{"$f":"\"[fr]\"&E338","v":"[fr]Europa"},{"$f":"\"[pt]\"&E338","v":"[pt]Europa"},{"$f":"\"[gr]\"&E338","v":"[gr]Europa"}]
["ABW",".aw","AW",{"$f":"A339&\" \"&HLOOKUP($C$1,$E$1:$X$4910,ROW(D339))","v":"ABW Aruba"},"Aruba","Aruba ","Aruba ","Aruba","Aruba",{"$f":"\"[pt]\"&E339","v":"[pt]Aruba"},{"$f":"\"[gr]\"&E339","v":"[gr]Aruba"},"ABW",{"$f":"IF(L339=A339,\"\",\"nix\")","v":""}]
["AFG",".af","AF",{"$f":"A340&\" \"&HLOOKUP($C$1,$E$1:$X$4910,ROW(D340))","v":"AFG Afghanistan"},"Afghanistan","Afghanistan ","Afghanistan ","Afganistán","Afghanistan",{"$f":"\"[pt]\"&E340","v":"[pt]Afghanistan"},{"$f":"\"[gr]\"&E340","v":"[gr]Afghanistan"},"AFG",{"$f":"IF(L340=A340,\"\",\"nix\")","v":""}]
["AGO",".ao","AO",{"$f":"A341&\" \"&HLOOKUP($C$1,$E$1:$X$4910,ROW(D341))","v":"AGO Angola"},"Angola","Angola ","Angola ","Angola","Angola",{"$f":"\"[pt]\"&E341","v":"[pt]Angola"},{"$f":"\"[gr]\"&E341","v":"[gr]Angola"},"AGO",{"$f":"IF(L341=A341,\"\",\"nix\")","v":""}]
["ALB",".al","AL",{"$f":"A342&\" \"&HLOOKUP($C$1,$E$1:$X$4910,ROW(D342))","v":"ALB Albania"},"Albanien","Albania ","Albania ","Albania","Albanie",{"$f":"\"[pt]\"&E342","v":"[pt]Albanien"},{"$f":"\"[gr]\"&E342","v":"[gr]Albanien"},"ALB",{"$f":"IF(L342=A342,\"\",\"nix\")","v":""}]
["AND",".ad","AD",{"$f":"A343&\" \"&HLOOKUP($C$1,$E$1:$X$4910,ROW(D343))","v":"AND Andorra"},"Andorra","Andorra ","Andorra ","Andorra","Andorre",{"$f":"\"[pt]\"&E343","v":"[pt]Andorra"},{"$f":"\"[gr]\"&E343","v":"[gr]Andorra"},"AND",{"$f":"IF(L343=A343,\"\",\"nix\")","v":""}]
["ARE",".ae","AE",{"$f":"A344&\" \"&HLOOKUP($C$1,$E$1:$X$4910,ROW(D344))","v":"ARE United Arab Emirates"},"Vereinigte Arabische Emirate","Emirati Arabi Uniti ","United Arab Emirates ","Emiratos Árabes Unidos","Émirats Arabes Unis",{"$f":"\"[pt]\"&E344","v":"[pt]Vereinigte Arabische Emirate"},{"$f":"\"[gr]\"&E344","v":"[gr]Vereinigte Arabische Emirate"},"ARE",{"$f":"IF(L344=A344,\"\",\"nix\")","v":""}]
["ARG",".ar","AR",{"$f":"A345&\" \"&HLOOKUP($C$1,$E$1:$X$4910,ROW(D345))","v":"ARG Argentina"},"Argentinien","Argentina ","Argentina ","Argentina","Argentine",{"$f":"\"[pt]\"&E345","v":"[pt]Argentinien"},{"$f":"\"[gr]\"&E345","v":"[gr]Argentinien"},"ARG",{"$f":"IF(L345=A345,\"\",\"nix\")","v":""}]
["ARM",".am","AM",{"$f":"A346&\" \"&HLOOKUP($C$1,$E$1:$X$4910,ROW(D346))","v":"ARM Armenia"},"Armenien","Armenia ","Armenia ","Armenia","Arménie",{"$f":"\"[pt]\"&E346","v":"[pt]Armenien"},{"$f":"\"[gr]\"&E346","v":"[gr]Armenien"},"ARM",{"$f":"IF(L346=A346,\"\",\"nix\")","v":""}]
["ASM",".as","AS",{"$f":"A347&\" \"&HLOOKUP($C$1,$E$1:$X$4910,ROW(D347))","v":"ASM American Samoa"},"Amerikanisch-Samoa","Samoa americane ","American Samoa ","Samoa Americana","Samoa américaines",{"$f":"\"[pt]\"&E347","v":"[pt]Amerikanisch-Samoa"},{"$f":"\"[gr]\"&E347","v":"[gr]Amerikanisch-Samoa"},"ASM",{"$f":"IF(L347=A347,\"\",\"nix\")","v":""}]
["ATG",".ag","AG",{"$f":"A348&\" \"&HLOOKUP($C$1,$E$1:$X$4910,ROW(D348))","v":"ATG Antigua and Barbuda"},"Antigua und Barbuda","Antigua e Barbuda ","Antigua and Barbuda ","Antigua y Barbuda","Antigua-et-Barbuda",{"$f":"\"[pt]\"&E348","v":"[pt]Antigua und Barbuda"},{"$f":"\"[gr]\"&E348","v":"[gr]Antigua und Barbuda"},"ATG",{"$f":"IF(L348=A348,\"\",\"nix\")","v":""}]
["AUS",".au","AU",{"$f":"A349&\" \"&HLOOKUP($C$1,$E$1:$X$4910,ROW(D349))","v":"AUS Australia"},"Australien","Australia ","Australia ","Australia","Australie",{"$f":"\"[pt]\"&E349","v":"[pt]Australien"},{"$f":"\"[gr]\"&E349","v":"[gr]Australien"},"AUS",{"$f":"IF(L349=A349,\"\",\"nix\")","v":""}]
["AUT",".at","AT",{"$f":"A350&\" \"&HLOOKUP($C$1,$E$1:$X$4910,ROW(D350))","v":"AUT Austria"},"Österreich","Austria ","Austria ","Austria","Autriche",{"$f":"\"[pt]\"&E350","v":"[pt]Österreich"},{"$f":"\"[gr]\"&E350","v":"[gr]Österreich"},"AUT",{"$f":"IF(L350=A350,\"\",\"nix\")","v":""}]
["AZE",".az","AZ",{"$f":"A351&\" \"&HLOOKUP($C$1,$E$1:$X$4910,ROW(D351))","v":"AZE Azerbaijan"},"Aserbaidschan","Azerbaigian ","Azerbaijan ","Azerbaiyán","Azerbaïdjan",{"$f":"\"[pt]\"&E351","v":"[pt]Aserbaidschan"},{"$f":"\"[gr]\"&E351","v":"[gr]Aserbaidschan"},"AZE",{"$f":"IF(L351=A351,\"\",\"nix\")","v":""}]
["BDI",".bi","BI",{"$f":"A352&\" \"&HLOOKUP($C$1,$E$1:$X$4910,ROW(D352))","v":"BDI Burundi"},"Burundi","Burundi ","Burundi ","Burundi","Burundi",{"$f":"\"[pt]\"&E352","v":"[pt]Burundi"},{"$f":"\"[gr]\"&E352","v":"[gr]Burundi"},"BDI",{"$f":"IF(L352=A352,\"\",\"nix\")","v":""}]
["BEL",".be","BE",{"$f":"A353&\" \"&HLOOKUP($C$1,$E$1:$X$4910,ROW(D353))","v":"BEL Belgium"},"Belgien","Belgio ","Belgium ","Bélgica","Belgique",{"$f":"\"[pt]\"&E353","v":"[pt]Belgien"},{"$f":"\"[gr]\"&E353","v":"[gr]Belgien"},"BEL",{"$f":"IF(L353=A353,\"\",\"nix\")","v":""}]
["BEN",".bj","BJ",{"$f":"A354&\" \"&HLOOKUP($C$1,$E$1:$X$4910,ROW(D354))","v":"BEN Benin"},"Benin","Benin ","Benin ","Benín","Bénin",{"$f":"\"[pt]\"&E354","v":"[pt]Benin"},{"$f":"\"[gr]\"&E354","v":"[gr]Benin"},"BEN",{"$f":"IF(L354=A354,\"\",\"nix\")","v":""}]
["BFA",".bf","BF",{"$f":"A355&\" \"&HLOOKUP($C$1,$E$1:$X$4910,ROW(D355))","v":"BFA Burkina Faso"},"Burkina Faso","Burkina Faso ","Burkina Faso ","Burkina Faso","Burkina Faso",{"$f":"\"[pt]\"&E355","v":"[pt]Burkina Faso"},{"$f":"\"[gr]\"&E355","v":"[gr]Burkina Faso"},"BFA",{"$f":"IF(L355=A355,\"\",\"nix\")","v":""}]
["BGD",".bd","BD",{"$f":"A356&\" \"&HLOOKUP($C$1,$E$1:$X$4910,ROW(D356))","v":"BGD Bangladesh"},"Bangladesch","Bangladesh ","Bangladesh ","Bangladés","Bangladesh",{"$f":"\"[pt]\"&E356","v":"[pt]Bangladesch"},{"$f":"\"[gr]\"&E356","v":"[gr]Bangladesch"},"BGD",{"$f":"IF(L356=A356,\"\",\"nix\")","v":""}]
["BGR",".bg","BG",{"$f":"A357&\" \"&HLOOKUP($C$1,$E$1:$X$4910,ROW(D357))","v":"BGR Bulgaria"},"Bulgarien","Bulgaria ","Bulgaria ","Bulgaria","Bulgarie",{"$f":"\"[pt]\"&E357","v":"[pt]Bulgarien"},{"$f":"\"[gr]\"&E357","v":"[gr]Bulgarien"},"BGR",{"$f":"IF(L357=A357,\"\",\"nix\")","v":""}]
["BHR",".bh","BH",{"$f":"A358&\" \"&HLOOKUP($C$1,$E$1:$X$4910,ROW(D358))","v":"BHR Bahrain"},"Bahrain","Bahrain ","Bahrain ","Baréin","Bahreïn",{"$f":"\"[pt]\"&E358","v":"[pt]Bahrain"},{"$f":"\"[gr]\"&E358","v":"[gr]Bahrain"},"BHR",{"$f":"IF(L358=A358,\"\",\"nix\")","v":""}]
["BHS",".bs","BS",{"$f":"A359&\" \"&HLOOKUP($C$1,$E$1:$X$4910,ROW(D359))","v":"BHS Bahamas"},"Bahamas","Bahamas ","Bahamas ","Bahamas","Bahamas",{"$f":"\"[pt]\"&E359","v":"[pt]Bahamas"},{"$f":"\"[gr]\"&E359","v":"[gr]Bahamas"},"BHS",{"$f":"IF(L359=A359,\"\",\"nix\")","v":""}]
["BIH",".ba","BA",{"$f":"A360&\" \"&HLOOKUP($C$1,$E$1:$X$4910,ROW(D360))","v":"BIH Bosnia and Herzegovina"},"Bosnien und Herzegowina","Bosnia ed Erzegovina ","Bosnia and Herzegovina ","Bosnia y Herzegovina","Bosnie-Herzégovine",{"$f":"\"[pt]\"&E360","v":"[pt]Bosnien und Herzegowina"},{"$f":"\"[gr]\"&E360","v":"[gr]Bosnien und Herzegowina"},"BIH",{"$f":"IF(L360=A360,\"\",\"nix\")","v":""}]
["BLR",".by","BY",{"$f":"A361&\" \"&HLOOKUP($C$1,$E$1:$X$4910,ROW(D361))","v":"BLR Belarus"},"Belarus","Bielorussia ","Belarus ","Bielorrusia","Biélorussie",{"$f":"\"[pt]\"&E361","v":"[pt]Belarus"},{"$f":"\"[gr]\"&E361","v":"[gr]Belarus"},"BLR",{"$f":"IF(L361=A361,\"\",\"nix\")","v":""}]
["BLZ",".bz","BZ",{"$f":"A362&\" \"&HLOOKUP($C$1,$E$1:$X$4910,ROW(D362))","v":"BLZ Belize"},"Belize","Belize ","Belize ","Belice","Belize",{"$f":"\"[pt]\"&E362","v":"[pt]Belize"},{"$f":"\"[gr]\"&E362","v":"[gr]Belize"},"BLZ",{"$f":"IF(L362=A362,\"\",\"nix\")","v":""}]
["BMU",".bm","BM",{"$f":"A363&\" \"&HLOOKUP($C$1,$E$1:$X$4910,ROW(D363))","v":"BMU Bermuda"},"Bermuda","Bermuda ","Bermuda ","Bermudas","Bermudes",{"$f":"\"[pt]\"&E363","v":"[pt]Bermuda"},{"$f":"\"[gr]\"&E363","v":"[gr]Bermuda"},"BMU",{"$f":"IF(L363=A363,\"\",\"nix\")","v":""}]
["BOL",".bo","BO",{"$f":"A364&\" \"&HLOOKUP($C$1,$E$1:$X$4910,ROW(D364))","v":"BOL Bolivia, Plurinational State of"},"Bolivien","Bolivia ","Bolivia, Plurinational State of ","Bolivia","Bolivie",{"$f":"\"[pt]\"&E364","v":"[pt]Bolivien"},{"$f":"\"[gr]\"&E364","v":"[gr]Bolivien"},"BOL",{"$f":"IF(L364=A364,\"\",\"nix\")","v":""}]
["BRA",".br","BR",{"$f":"A365&\" \"&HLOOKUP($C$1,$E$1:$X$4910,ROW(D365))","v":"BRA Brazil"},"Brasilien","Brasile ","Brazil ","Brasil","Brésil",{"$f":"\"[pt]\"&E365","v":"[pt]Brasilien"},{"$f":"\"[gr]\"&E365","v":"[gr]Brasilien"},"BRA",{"$f":"IF(L365=A365,\"\",\"nix\")","v":""}]
["BRB",".bb","BB",{"$f":"A366&\" \"&HLOOKUP($C$1,$E$1:$X$4910,ROW(D366))","v":"BRB Barbados"},"Barbados","Barbados ","Barbados ","Barbados","Barbades",{"$f":"\"[pt]\"&E366","v":"[pt]Barbados"},{"$f":"\"[gr]\"&E366","v":"[gr]Barbados"},"BRB",{"$f":"IF(L366=A366,\"\",\"nix\")","v":""}]
["BRN",".bn","BN",{"$f":"A367&\" \"&HLOOKUP($C$1,$E$1:$X$4910,ROW(D367))","v":"BRN Brunei Darussalam"},"Brunei Darussalam","Brunei ","Brunei Darussalam ","Brunéi","Brunei",{"$f":"\"[pt]\"&E367","v":"[pt]Brunei Darussalam"},{"$f":"\"[gr]\"&E367","v":"[gr]Brunei Darussalam"},"BRN",{"$f":"IF(L367=A367,\"\",\"nix\")","v":""}]
["BTN",".bt","BT",{"$f":"A368&\" \"&HLOOKUP($C$1,$E$1:$X$4910,ROW(D368))","v":"BTN Bhutan"},"Bhutan","Bhutan ","Bhutan ","Bután","Bhoutan",{"$f":"\"[pt]\"&E368","v":"[pt]Bhutan"},{"$f":"\"[gr]\"&E368","v":"[gr]Bhutan"},"BTN",{"$f":"IF(L368=A368,\"\",\"nix\")","v":""}]
["BWA",".bw","BW",{"$f":"A369&\" \"&HLOOKUP($C$1,$E$1:$X$4910,ROW(D369))","v":"BWA Botswana"},"Botswana","Botswana ","Botswana ","Botsuana","Botswana",{"$f":"\"[pt]\"&E369","v":"[pt]Botswana"},{"$f":"\"[gr]\"&E369","v":"[gr]Botswana"},"BWA",{"$f":"IF(L369=A369,\"\",\"nix\")","v":""}]
["CAF",".cf","CF",{"$f":"A370&\" \"&HLOOKUP($C$1,$E$1:$X$4910,ROW(D370))","v":"CAF Central African Republic"},"Zentralafrikanische Republik","Repubblica Centrafricana ","Central African Republic ","República Centroafricana","République centrafricaine",{"$f":"\"[pt]\"&E370","v":"[pt]Zentralafrikanische Republik"},{"$f":"\"[gr]\"&E370","v":"[gr]Zentralafrikanische Republik"},"CAF",{"$f":"IF(L370=A370,\"\",\"nix\")","v":""}]
["CAN",".ca","CA",{"$f":"A371&\" \"&HLOOKUP($C$1,$E$1:$X$4910,ROW(D371))","v":"CAN Canada"},"Kanada","Canada ","Canada ","Canadá","Canada",{"$f":"\"[pt]\"&E371","v":"[pt]Kanada"},{"$f":"\"[gr]\"&E371","v":"[gr]Kanada"},"CAN",{"$f":"IF(L371=A371,\"\",\"nix\")","v":""}]
["CHE",".ch","CH",{"$f":"A372&\" \"&HLOOKUP($C$1,$E$1:$X$4910,ROW(D372))","v":"CHE Switzerland"},"Schweiz (Confoederatio Helvetica)","della Svizzera Svizzera ","Switzerland ","Suiza","Suisse",{"$f":"\"[pt]\"&E372","v":"[pt]Schweiz (Confoederatio Helvetica)"},{"$f":"\"[gr]\"&E372","v":"[gr]Schweiz (Confoederatio Helvetica)"},"CHE",{"$f":"IF(L372=A372,\"\",\"nix\")","v":""}]
["CHL",".cl","CL",{"$f":"A373&\" \"&HLOOKUP($C$1,$E$1:$X$4910,ROW(D373))","v":"CHL Chile"},"Chile","Cile ","Chile ","Chile","Chili",{"$f":"\"[pt]\"&E373","v":"[pt]Chile"},{"$f":"\"[gr]\"&E373","v":"[gr]Chile"},"CHL",{"$f":"IF(L373=A373,\"\",\"nix\")","v":""}]
["CHN",".cn","CN",{"$f":"A374&\" \"&HLOOKUP($C$1,$E$1:$X$4910,ROW(D374))","v":"CHN China"},"China, Volksrepublik","Cina ","China ","China","Chine",{"$f":"\"[pt]\"&E374","v":"[pt]China, Volksrepublik"},{"$f":"\"[gr]\"&E374","v":"[gr]China, Volksrepublik"},"CHN",{"$f":"IF(L374=A374,\"\",\"nix\")","v":""}]
["CIV",".ci","CI",{"$f":"A375&\" \"&HLOOKUP($C$1,$E$1:$X$4910,ROW(D375))","v":"CIV Côte d'Ivoire"},"Côte d’Ivoire (Elfenbeinküste)","Costa d'Avorio ","Côte d'Ivoire ","Costa de Marfil","Côte-d'Ivoire",{"$f":"\"[pt]\"&E375","v":"[pt]Côte d’Ivoire (Elfenbeinküste)"},{"$f":"\"[gr]\"&E375","v":"[gr]Côte d’Ivoire (Elfenbeinküste)"},"CIV",{"$f":"IF(L375=A375,\"\",\"nix\")","v":""}]
["CMR",".cm","CM",{"$f":"A376&\" \"&HLOOKUP($C$1,$E$1:$X$4910,ROW(D376))","v":"CMR Cameroon"},"Kamerun","Camerun ","Cameroon ","Camerún","Cameroun",{"$f":"\"[pt]\"&E376","v":"[pt]Kamerun"},{"$f":"\"[gr]\"&E376","v":"[gr]Kamerun"},"CMR",{"$f":"IF(L376=A376,\"\",\"nix\")","v":""}]
["COD",".cd","CD",{"$f":"A377&\" \"&HLOOKUP($C$1,$E$1:$X$4910,ROW(D377))","v":"COD Congo, the Democratic Republic of the"},"Kongo, Demokratische Republik (ehem. Zaire)","Repubblica Democratica del Congo ","Congo, the Democratic Republic of the ","Rep. Dem. del Congo","République démocratique du Congo",{"$f":"\"[pt]\"&E377","v":"[pt]Kongo, Demokratische Republik (ehem. Zaire)"},{"$f":"\"[gr]\"&E377","v":"[gr]Kongo, Demokratische Republik (ehem. Zaire)"},"COD",{"$f":"IF(L377=A377,\"\",\"nix\")","v":""}]
["COG",".cg","CG",{"$f":"A378&\" \"&HLOOKUP($C$1,$E$1:$X$4910,ROW(D378))","v":"COG Congo"},"Republik Kongo","Repubblica del Congo ","Congo ","República del Congo","République du Congo",{"$f":"\"[pt]\"&E378","v":"[pt]Republik Kongo"},{"$f":"\"[gr]\"&E378","v":"[gr]Republik Kongo"},"COG",{"$f":"IF(L378=A378,\"\",\"nix\")","v":""}]
["COL",".co","CO",{"$f":"A379&\" \"&HLOOKUP($C$1,$E$1:$X$4910,ROW(D379))","v":"COL Colombia"},"Kolumbien","Colombia ","Colombia ","Colombia","Colombie",{"$f":"\"[pt]\"&E379","v":"[pt]Kolumbien"},{"$f":"\"[gr]\"&E379","v":"[gr]Kolumbien"},"COL",{"$f":"IF(L379=A379,\"\",\"nix\")","v":""}]
["COM",".km","KM",{"$f":"A380&\" \"&HLOOKUP($C$1,$E$1:$X$4910,ROW(D380))","v":"COM Comoros"},"Komoren","Comore ","Comoros ","Comoras","Comores",{"$f":"\"[pt]\"&E380","v":"[pt]Komoren"},{"$f":"\"[gr]\"&E380","v":"[gr]Komoren"},"COM",{"$f":"IF(L380=A380,\"\",\"nix\")","v":""}]
["CPV",".cv","CV",{"$f":"A381&\" \"&HLOOKUP($C$1,$E$1:$X$4910,ROW(D381))","v":"CPV Cape Verde"},"Kap Verde","Capo Verde ","Cape Verde ","Cabo Verde","Cap vert",{"$f":"\"[pt]\"&E381","v":"[pt]Kap Verde"},{"$f":"\"[gr]\"&E381","v":"[gr]Kap Verde"},"CPV",{"$f":"IF(L381=A381,\"\",\"nix\")","v":""}]
["CRI",".cr","CR",{"$f":"A382&\" \"&HLOOKUP($C$1,$E$1:$X$4910,ROW(D382))","v":"CRI Costa Rica"},"Costa Rica","Costa Rica ","Costa Rica ","Costa Rica","Costa Rica",{"$f":"\"[pt]\"&E382","v":"[pt]Costa Rica"},{"$f":"\"[gr]\"&E382","v":"[gr]Costa Rica"},"CRI",{"$f":"IF(L382=A382,\"\",\"nix\")","v":""}]
["CUB",".cu","CU",{"$f":"A383&\" \"&HLOOKUP($C$1,$E$1:$X$4910,ROW(D383))","v":"CUB Cuba"},"Kuba","Cuba ","Cuba ","Cuba","Cuba",{"$f":"\"[pt]\"&E383","v":"[pt]Kuba"},{"$f":"\"[gr]\"&E383","v":"[gr]Kuba"},"CUB",{"$f":"IF(L383=A383,\"\",\"nix\")","v":""}]
["CUW",".cw","CW",{"$f":"A384&\" \"&HLOOKUP($C$1,$E$1:$X$4910,ROW(D384))","v":"CUW Curaçao"},"Curaçao","Curaçao ","Curaçao ","Curazao","Curaçao",{"$f":"\"[pt]\"&E384","v":"[pt]Curaçao"},{"$f":"\"[gr]\"&E384","v":"[gr]Curaçao"},"CUW",{"$f":"IF(L384=A384,\"\",\"nix\")","v":""}]
["CYM",".ky","KY",{"$f":"A385&\" \"&HLOOKUP($C$1,$E$1:$X$4910,ROW(D385))","v":"CYM Cayman Islands"},"Kaimaninseln","Isole Cayman ","Cayman Islands ","Islas Caimán","Îles Caïmans",{"$f":"\"[pt]\"&E385","v":"[pt]Kaimaninseln"},{"$f":"\"[gr]\"&E385","v":"[gr]Kaimaninseln"},"CYM",{"$f":"IF(L385=A385,\"\",\"nix\")","v":""}]
["CYP",".cy","CY",{"$f":"A386&\" \"&HLOOKUP($C$1,$E$1:$X$4910,ROW(D386))","v":"CYP Cyprus"},"Zypern","Cipro ","Cyprus ","Chipre","Chypre",{"$f":"\"[pt]\"&E386","v":"[pt]Zypern"},{"$f":"\"[gr]\"&E386","v":"[gr]Zypern"},"CYP",{"$f":"IF(L386=A386,\"\",\"nix\")","v":""}]
["CZE",".cz","CZ",{"$f":"A387&\" \"&HLOOKUP($C$1,$E$1:$X$4910,ROW(D387))","v":"CZE Czech Republic"},"Tschechische Republik","Repubblica Ceca ","Czech Republic ","República Checa","République Tchèque",{"$f":"\"[pt]\"&E387","v":"[pt]Tschechische Republik"},{"$f":"\"[gr]\"&E387","v":"[gr]Tschechische Republik"},"CZE",{"$f":"IF(L387=A387,\"\",\"nix\")","v":""}]
["DEU",".de","DE",{"$f":"A388&\" \"&HLOOKUP($C$1,$E$1:$X$4910,ROW(D388))","v":"DEU Germany"},"Deutschland","Germania ","Germany ","Alemania","Allemagne",{"$f":"\"[pt]\"&E388","v":"[pt]Deutschland"},{"$f":"\"[gr]\"&E388","v":"[gr]Deutschland"},"DEU",{"$f":"IF(L388=A388,\"\",\"nix\")","v":""}]
["DJI",".dj","DJ",{"$f":"A389&\" \"&HLOOKUP($C$1,$E$1:$X$4910,ROW(D389))","v":"DJI Djibouti"},"Dschibuti","Gibuti ","Djibouti ","Yibuti","Djibouti",{"$f":"\"[pt]\"&E389","v":"[pt]Dschibuti"},{"$f":"\"[gr]\"&E389","v":"[gr]Dschibuti"},"DJI",{"$f":"IF(L389=A389,\"\",\"nix\")","v":""}]
["DMA",".dm","DM",{"$f":"A390&\" \"&HLOOKUP($C$1,$E$1:$X$4910,ROW(D390))","v":"DMA Dominica"},"Dominica","Dominica ","Dominica ","Dominica","Dominique",{"$f":"\"[pt]\"&E390","v":"[pt]Dominica"},{"$f":"\"[gr]\"&E390","v":"[gr]Dominica"},"DMA",{"$f":"IF(L390=A390,\"\",\"nix\")","v":""}]
["DNK",".dk","DK",{"$f":"A391&\" \"&HLOOKUP($C$1,$E$1:$X$4910,ROW(D391))","v":"DNK Denmark"},"Dänemark","Danimarca ","Denmark ","Dinamarca","Danemark",{"$f":"\"[pt]\"&E391","v":"[pt]Dänemark"},{"$f":"\"[gr]\"&E391","v":"[gr]Dänemark"},"DNK",{"$f":"IF(L391=A391,\"\",\"nix\")","v":""}]
["DOM",".do","DO",{"$f":"A392&\" \"&HLOOKUP($C$1,$E$1:$X$4910,ROW(D392))","v":"DOM Dominican Republic"},"Dominikanische Republik","Repubblica Dominicana ","Dominican Republic ","República Dominicana","République Dominicaine",{"$f":"\"[pt]\"&E392","v":"[pt]Dominikanische Republik"},{"$f":"\"[gr]\"&E392","v":"[gr]Dominikanische Republik"},"DOM",{"$f":"IF(L392=A392,\"\",\"nix\")","v":""}]
["DZA",".dz","DZ",{"$f":"A393&\" \"&HLOOKUP($C$1,$E$1:$X$4910,ROW(D393))","v":"DZA Algeria"},"Algerien","Algeria ","Algeria ","Argelia","Algérie",{"$f":"\"[pt]\"&E393","v":"[pt]Algerien"},{"$f":"\"[gr]\"&E393","v":"[gr]Algerien"},"DZA",{"$f":"IF(L393=A393,\"\",\"nix\")","v":""}]
["ECU",".ec","EC",{"$f":"A394&\" \"&HLOOKUP($C$1,$E$1:$X$4910,ROW(D394))","v":"ECU Ecuador"},"Ecuador","Ecuador ","Ecuador ","Ecuador","Équateur",{"$f":"\"[pt]\"&E394","v":"[pt]Ecuador"},{"$f":"\"[gr]\"&E394","v":"[gr]Ecuador"},"ECU",{"$f":"IF(L394=A394,\"\",\"nix\")","v":""}]
["EGY",".eg","EG",{"$f":"A395&\" \"&HLOOKUP($C$1,$E$1:$X$4910,ROW(D395))","v":"EGY Egypt"},"Ägypten","Egitto ","Egypt ","Egipto","Égypte",{"$f":"\"[pt]\"&E395","v":"[pt]Ägypten"},{"$f":"\"[gr]\"&E395","v":"[gr]Ägypten"},"EGY",{"$f":"IF(L395=A395,\"\",\"nix\")","v":""}]
["ERI",".er","ER",{"$f":"A396&\" \"&HLOOKUP($C$1,$E$1:$X$4910,ROW(D396))","v":"ERI Eritrea"},"Eritrea","Eritrea ","Eritrea ","Eritrea","Érythrée",{"$f":"\"[pt]\"&E396","v":"[pt]Eritrea"},{"$f":"\"[gr]\"&E396","v":"[gr]Eritrea"},"ERI",{"$f":"IF(L396=A396,\"\",\"nix\")","v":""}]
["ESP",".es","ES",{"$f":"A397&\" \"&HLOOKUP($C$1,$E$1:$X$4910,ROW(D397))","v":"ESP Spain"},"Spanien","Spagna ","Spain ","España","Espagne",{"$f":"\"[pt]\"&E397","v":"[pt]Spanien"},{"$f":"\"[gr]\"&E397","v":"[gr]Spanien"},"ESP",{"$f":"IF(L397=A397,\"\",\"nix\")","v":""}]
["EST",".ee","EE",{"$f":"A398&\" \"&HLOOKUP($C$1,$E$1:$X$4910,ROW(D398))","v":"EST Estonia"},"Estland","Estonia ","Estonia ","Estonia","Estonie",{"$f":"\"[pt]\"&E398","v":"[pt]Estland"},{"$f":"\"[gr]\"&E398","v":"[gr]Estland"},"EST",{"$f":"IF(L398=A398,\"\",\"nix\")","v":""}]
["ETH",".et","ET",{"$f":"A399&\" \"&HLOOKUP($C$1,$E$1:$X$4910,ROW(D399))","v":"ETH Ethiopia"},"Äthiopien","Etiopia ","Ethiopia ","Etiopía","Éthiopie",{"$f":"\"[pt]\"&E399","v":"[pt]Äthiopien"},{"$f":"\"[gr]\"&E399","v":"[gr]Äthiopien"},"ETH",{"$f":"IF(L399=A399,\"\",\"nix\")","v":""}]
["FIN",".fi","FI",{"$f":"A400&\" \"&HLOOKUP($C$1,$E$1:$X$4910,ROW(D400))","v":"FIN Finland"},"Finnland","Finlandia ","Finland ","Finlandia","Finlande",{"$f":"\"[pt]\"&E400","v":"[pt]Finnland"},{"$f":"\"[gr]\"&E400","v":"[gr]Finnland"},"FIN",{"$f":"IF(L400=A400,\"\",\"nix\")","v":""}]
["FJI",".fj","FJ",{"$f":"A401&\" \"&HLOOKUP($C$1,$E$1:$X$4910,ROW(D401))","v":"FJI Fiji"},"Fidschi","Figi ","Fiji ","Fiyi","Fiji",{"$f":"\"[pt]\"&E401","v":"[pt]Fidschi"},{"$f":"\"[gr]\"&E401","v":"[gr]Fidschi"},"FJI",{"$f":"IF(L401=A401,\"\",\"nix\")","v":""}]
["FRA",".fr","FR",{"$f":"A402&\" \"&HLOOKUP($C$1,$E$1:$X$4910,ROW(D402))","v":"FRA France"},"Frankreich","Francia ","France ","Francia","France",{"$f":"\"[pt]\"&E402","v":"[pt]Frankreich"},{"$f":"\"[gr]\"&E402","v":"[gr]Frankreich"},"FRA",{"$f":"IF(L402=A402,\"\",\"nix\")","v":""}]
["FRO",".fo","FO",{"$f":"A403&\" \"&HLOOKUP($C$1,$E$1:$X$4910,ROW(D403))","v":"FRO Faroe Islands"},"Färöer","Isole Fær Øer ","Faroe Islands ","Islas Feroe","Îles Féroé",{"$f":"\"[pt]\"&E403","v":"[pt]Färöer"},{"$f":"\"[gr]\"&E403","v":"[gr]Färöer"},"FRO",{"$f":"IF(L403=A403,\"\",\"nix\")","v":""}]
["FSM",".fm","FM",{"$f":"A404&\" \"&HLOOKUP($C$1,$E$1:$X$4910,ROW(D404))","v":"FSM Micronesia, Federated States of"},"Mikronesien","Micronesia ","Micronesia, Federated States of ","Micronesia","Micronésie",{"$f":"\"[pt]\"&E404","v":"[pt]Mikronesien"},{"$f":"\"[gr]\"&E404","v":"[gr]Mikronesien"},"FSM",{"$f":"IF(L404=A404,\"\",\"nix\")","v":""}]
["GAB",".ga","GA",{"$f":"A405&\" \"&HLOOKUP($C$1,$E$1:$X$4910,ROW(D405))","v":"GAB Gabon"},"Gabun","Gabon ","Gabon ","Gabón","Gabon",{"$f":"\"[pt]\"&E405","v":"[pt]Gabun"},{"$f":"\"[gr]\"&E405","v":"[gr]Gabun"},"GAB",{"$f":"IF(L405=A405,\"\",\"nix\")","v":""}]
["GBR",".uk","GB",{"$f":"A406&\" \"&HLOOKUP($C$1,$E$1:$X$4910,ROW(D406))","v":"GBR United Kingdom"},"Vereinigtes Königreich Großbritannien und Nordirland","Regno Unito ","United Kingdom ","Reino Unido","Royaume-Uni",{"$f":"\"[pt]\"&E406","v":"[pt]Vereinigtes Königreich Großbritannien und Nordirland"},{"$f":"\"[gr]\"&E406","v":"[gr]Vereinigtes Königreich Großbritannien und Nordirland"},"GBR",{"$f":"IF(L406=A406,\"\",\"nix\")","v":""}]
["GEO",".ge","GE",{"$f":"A407&\" \"&HLOOKUP($C$1,$E$1:$X$4910,ROW(D407))","v":"GEO Georgia"},"Georgien","Georgia ","Georgia ","Georgia","État de Géorgie",{"$f":"\"[pt]\"&E407","v":"[pt]Georgien"},{"$f":"\"[gr]\"&E407","v":"[gr]Georgien"},"GEO",{"$f":"IF(L407=A407,\"\",\"nix\")","v":""}]
["GHA",".gh","GH",{"$f":"A408&\" \"&HLOOKUP($C$1,$E$1:$X$4910,ROW(D408))","v":"GHA Ghana"},"Ghana","Ghana ","Ghana ","Ghana","Ghana",{"$f":"\"[pt]\"&E408","v":"[pt]Ghana"},{"$f":"\"[gr]\"&E408","v":"[gr]Ghana"},"GHA",{"$f":"IF(L408=A408,\"\",\"nix\")","v":""}]
["GIB",".gi","GI",{"$f":"A409&\" \"&HLOOKUP($C$1,$E$1:$X$4910,ROW(D409))","v":"GIB Gibraltar"},"Gibraltar","Gibilterra ","Gibraltar ","Gibraltar","Gribraltar",{"$f":"\"[pt]\"&E409","v":"[pt]Gibraltar"},{"$f":"\"[gr]\"&E409","v":"[gr]Gibraltar"},"GIB",{"$f":"IF(L409=A409,\"\",\"nix\")","v":""}]
["GIN",".gn","GN",{"$f":"A410&\" \"&HLOOKUP($C$1,$E$1:$X$4910,ROW(D410))","v":"GIN Guinea"},"Guinea","Guinea ","Guinea ","Guinea","Guinée",{"$f":"\"[pt]\"&E410","v":"[pt]Guinea"},{"$f":"\"[gr]\"&E410","v":"[gr]Guinea"},"GIN",{"$f":"IF(L410=A410,\"\",\"nix\")","v":""}]
["GMB",".gm","GM",{"$f":"A411&\" \"&HLOOKUP($C$1,$E$1:$X$4910,ROW(D411))","v":"GMB Gambia"},"Gambia","Gambia ","Gambia ","Gambia","Gambie",{"$f":"\"[pt]\"&E411","v":"[pt]Gambia"},{"$f":"\"[gr]\"&E411","v":"[gr]Gambia"},"GMB",{"$f":"IF(L411=A411,\"\",\"nix\")","v":""}]
["GNB",".gw","GW",{"$f":"A412&\" \"&HLOOKUP($C$1,$E$1:$X$4910,ROW(D412))","v":"GNB Guinea-Bissau"},"Guinea-Bissau","Guinea-Bissau ","Guinea-Bissau ","Guinea-Bisáu","Guinée-Bissau",{"$f":"\"[pt]\"&E412","v":"[pt]Guinea-Bissau"},{"$f":"\"[gr]\"&E412","v":"[gr]Guinea-Bissau"},"GNB",{"$f":"IF(L412=A412,\"\",\"nix\")","v":""}]
["GNQ",".gq","GQ",{"$f":"A413&\" \"&HLOOKUP($C$1,$E$1:$X$4910,ROW(D413))","v":"GNQ Equatorial Guinea"},"Äquatorialguinea","Guinea Equatoriale ","Equatorial Guinea ","Guinea Ecuatorial","Guinée équatoriale",{"$f":"\"[pt]\"&E413","v":"[pt]Äquatorialguinea"},{"$f":"\"[gr]\"&E413","v":"[gr]Äquatorialguinea"},"GNQ",{"$f":"IF(L413=A413,\"\",\"nix\")","v":""}]
["GRC",".gr","GR",{"$f":"A414&\" \"&HLOOKUP($C$1,$E$1:$X$4910,ROW(D414))","v":"GRC Greece"},"Griechenland","Grecia ","Greece ","Grecia","Grèce",{"$f":"\"[pt]\"&E414","v":"[pt]Griechenland"},{"$f":"\"[gr]\"&E414","v":"[gr]Griechenland"},"GRC",{"$f":"IF(L414=A414,\"\",\"nix\")","v":""}]
["GRD",".gd","GD",{"$f":"A415&\" \"&HLOOKUP($C$1,$E$1:$X$4910,ROW(D415))","v":"GRD Grenada"},"Grenada","Grenada ","Grenada ","Granada","Grenade",{"$f":"\"[pt]\"&E415","v":"[pt]Grenada"},{"$f":"\"[gr]\"&E415","v":"[gr]Grenada"},"GRD",{"$f":"IF(L415=A415,\"\",\"nix\")","v":""}]
["GRL",".gl","GL",{"$f":"A416&\" \"&HLOOKUP($C$1,$E$1:$X$4910,ROW(D416))","v":"GRL Greenland"},"Grönland","Groenlandia ","Greenland ","Groenlandia","Groenland",{"$f":"\"[pt]\"&E416","v":"[pt]Grönland"},{"$f":"\"[gr]\"&E416","v":"[gr]Grönland"},"GRL",{"$f":"IF(L416=A416,\"\",\"nix\")","v":""}]
["GTM",".gt","GT",{"$f":"A417&\" \"&HLOOKUP($C$1,$E$1:$X$4910,ROW(D417))","v":"GTM Guatemala"},"Guatemala","Guatemala ","Guatemala ","Guatemala","Guatémala",{"$f":"\"[pt]\"&E417","v":"[pt]Guatemala"},{"$f":"\"[gr]\"&E417","v":"[gr]Guatemala"},"GTM",{"$f":"IF(L417=A417,\"\",\"nix\")","v":""}]
["GUM",".gu","GU",{"$f":"A418&\" \"&HLOOKUP($C$1,$E$1:$X$4910,ROW(D418))","v":"GUM Guam"},"Guam","Guam ","Guam ","Guam","Guam",{"$f":"\"[pt]\"&E418","v":"[pt]Guam"},{"$f":"\"[gr]\"&E418","v":"[gr]Guam"},"GUM",{"$f":"IF(L418=A418,\"\",\"nix\")","v":""}]
["GUY",".gy","GY",{"$f":"A419&\" \"&HLOOKUP($C$1,$E$1:$X$4910,ROW(D419))","v":"GUY Guyana"},"Guyana","Guyana ","Guyana ","Guyana","Guyane",{"$f":"\"[pt]\"&E419","v":"[pt]Guyana"},{"$f":"\"[gr]\"&E419","v":"[gr]Guyana"},"GUY",{"$f":"IF(L419=A419,\"\",\"nix\")","v":""}]
["HKG",".hk","HK",{"$f":"A420&\" \"&HLOOKUP($C$1,$E$1:$X$4910,ROW(D420))","v":"HKG Hong Kong"},"Hongkong","Hong Kong ","Hong Kong ","Hong Kong","Hong Kong",{"$f":"\"[pt]\"&E420","v":"[pt]Hongkong"},{"$f":"\"[gr]\"&E420","v":"[gr]Hongkong"},"HKG",{"$f":"IF(L420=A420,\"\",\"nix\")","v":""}]
["HND",".hn","HN",{"$f":"A421&\" \"&HLOOKUP($C$1,$E$1:$X$4910,ROW(D421))","v":"HND Honduras"},"Honduras","Honduras ","Honduras ","Honduras","Honduras",{"$f":"\"[pt]\"&E421","v":"[pt]Honduras"},{"$f":"\"[gr]\"&E421","v":"[gr]Honduras"},"HND",{"$f":"IF(L421=A421,\"\",\"nix\")","v":""}]
["HRV",".hr","HR",{"$f":"A422&\" \"&HLOOKUP($C$1,$E$1:$X$4910,ROW(D422))","v":"HRV Croatia"},"Kroatien","Croazia ","Croatia ","Croacia","Croatie",{"$f":"\"[pt]\"&E422","v":"[pt]Kroatien"},{"$f":"\"[gr]\"&E422","v":"[gr]Kroatien"},"HRV",{"$f":"IF(L422=A422,\"\",\"nix\")","v":""}]
["HTI",".ht","HT",{"$f":"A423&\" \"&HLOOKUP($C$1,$E$1:$X$4910,ROW(D423))","v":"HTI Haiti"},"Haiti","Haiti ","Haiti ","Haití","Haïti",{"$f":"\"[pt]\"&E423","v":"[pt]Haiti"},{"$f":"\"[gr]\"&E423","v":"[gr]Haiti"},"HTI",{"$f":"IF(L423=A423,\"\",\"nix\")","v":""}]
["HUN",".hu","HU",{"$f":"A424&\" \"&HLOOKUP($C$1,$E$1:$X$4910,ROW(D424))","v":"HUN Hungary"},"Ungarn","Ungheria ","Hungary ","Hungría","Hongrie",{"$f":"\"[pt]\"&E424","v":"[pt]Ungarn"},{"$f":"\"[gr]\"&E424","v":"[gr]Ungarn"},"HUN",{"$f":"IF(L424=A424,\"\",\"nix\")","v":""}]
["IDN",".id","ID",{"$f":"A425&\" \"&HLOOKUP($C$1,$E$1:$X$4910,ROW(D425))","v":"IDN Indonesia"},"Indonesien","Indonesia ","Indonesia ","Indonesia","Indonésie",{"$f":"\"[pt]\"&E425","v":"[pt]Indonesien"},{"$f":"\"[gr]\"&E425","v":"[gr]Indonesien"},"IDN",{"$f":"IF(L425=A425,\"\",\"nix\")","v":""}]
["IMN",".im","IM",{"$f":"A426&\" \"&HLOOKUP($C$1,$E$1:$X$4910,ROW(D426))","v":"IMN Isle of Man"},"Insel Man","Isola di Man ","Isle of Man ","Isla de Man","Île de Man",{"$f":"\"[pt]\"&E426","v":"[pt]Insel Man"},{"$f":"\"[gr]\"&E426","v":"[gr]Insel Man"},"IMN",{"$f":"IF(L426=A426,\"\",\"nix\")","v":""}]
["IND",".in","IN",{"$f":"A427&\" \"&HLOOKUP($C$1,$E$1:$X$4910,ROW(D427))","v":"IND India"},"Indien","India ","India ","India","Inde",{"$f":"\"[pt]\"&E427","v":"[pt]Indien"},{"$f":"\"[gr]\"&E427","v":"[gr]Indien"},"IND",{"$f":"IF(L427=A427,\"\",\"nix\")","v":""}]
["IRL",".ie","IE",{"$f":"A428&\" \"&HLOOKUP($C$1,$E$1:$X$4910,ROW(D428))","v":"IRL Ireland"},"Irland","Irlanda ","Ireland ","Irlanda","Irlande",{"$f":"\"[pt]\"&E428","v":"[pt]Irland"},{"$f":"\"[gr]\"&E428","v":"[gr]Irland"},"IRL",{"$f":"IF(L428=A428,\"\",\"nix\")","v":""}]
["IRN",".ir","IR",{"$f":"A429&\" \"&HLOOKUP($C$1,$E$1:$X$4910,ROW(D429))","v":"IRN Iran, Islamic Republic of"},"Iran, Islamische Republik","Iran ","Iran, Islamic Republic of ","Irán","Iran",{"$f":"\"[pt]\"&E429","v":"[pt]Iran, Islamische Republik"},{"$f":"\"[gr]\"&E429","v":"[gr]Iran, Islamische Republik"},"IRN",{"$f":"IF(L429=A429,\"\",\"nix\")","v":""}]
["IRQ",".iq","IQ",{"$f":"A430&\" \"&HLOOKUP($C$1,$E$1:$X$4910,ROW(D430))","v":"IRQ Iraq"},"Irak","Iraq ","Iraq ","Irak","Irak",{"$f":"\"[pt]\"&E430","v":"[pt]Irak"},{"$f":"\"[gr]\"&E430","v":"[gr]Irak"},"IRQ",{"$f":"IF(L430=A430,\"\",\"nix\")","v":""}]
["ISL",".is","IS",{"$f":"A431&\" \"&HLOOKUP($C$1,$E$1:$X$4910,ROW(D431))","v":"ISL Iceland"},"Island","Islanda ","Iceland ","Islandia","Islande",{"$f":"\"[pt]\"&E431","v":"[pt]Island"},{"$f":"\"[gr]\"&E431","v":"[gr]Island"},"ISL",{"$f":"IF(L431=A431,\"\",\"nix\")","v":""}]
["ISR",".il","IL",{"$f":"A432&\" \"&HLOOKUP($C$1,$E$1:$X$4910,ROW(D432))","v":"ISR Israel"},"Israel","Israele ","Israel ","Israel","Israël",{"$f":"\"[pt]\"&E432","v":"[pt]Israel"},{"$f":"\"[gr]\"&E432","v":"[gr]Israel"},"ISR",{"$f":"IF(L432=A432,\"\",\"nix\")","v":""}]
["ITA",".it","IT",{"$f":"A433&\" \"&HLOOKUP($C$1,$E$1:$X$4910,ROW(D433))","v":"ITA Italy"},"Italien","Italia ","Italy ","Italia","Italie",{"$f":"\"[pt]\"&E433","v":"[pt]Italien"},{"$f":"\"[gr]\"&E433","v":"[gr]Italien"},"ITA",{"$f":"IF(L433=A433,\"\",\"nix\")","v":""}]
["JAM",".jm","JM",{"$f":"A434&\" \"&HLOOKUP($C$1,$E$1:$X$4910,ROW(D434))","v":"JAM Jamaica"},"Jamaika","Giamaica ","Jamaica ","Jamaica","Jamaïque",{"$f":"\"[pt]\"&E434","v":"[pt]Jamaika"},{"$f":"\"[gr]\"&E434","v":"[gr]Jamaika"},"JAM",{"$f":"IF(L434=A434,\"\",\"nix\")","v":""}]
["JOR",".jo","JO",{"$f":"A435&\" \"&HLOOKUP($C$1,$E$1:$X$4910,ROW(D435))","v":"JOR Jordan"},"Jordanien","Giordania ","Jordan ","Jordania","Jordanie",{"$f":"\"[pt]\"&E435","v":"[pt]Jordanien"},{"$f":"\"[gr]\"&E435","v":"[gr]Jordanien"},"JOR",{"$f":"IF(L435=A435,\"\",\"nix\")","v":""}]
["JPN",".jp","JP",{"$f":"A436&\" \"&HLOOKUP($C$1,$E$1:$X$4910,ROW(D436))","v":"JPN Japan"},"Japan","Giappone ","Japan ","Japón","Japon",{"$f":"\"[pt]\"&E436","v":"[pt]Japan"},{"$f":"\"[gr]\"&E436","v":"[gr]Japan"},"JPN",{"$f":"IF(L436=A436,\"\",\"nix\")","v":""}]
["KAZ",".kz","KZ",{"$f":"A437&\" \"&HLOOKUP($C$1,$E$1:$X$4910,ROW(D437))","v":"KAZ Kazakhstan"},"Kasachstan","Kazakistan ","Kazakhstan ","Kazajistán","Kazakhstan",{"$f":"\"[pt]\"&E437","v":"[pt]Kasachstan"},{"$f":"\"[gr]\"&E437","v":"[gr]Kasachstan"},"KAZ",{"$f":"IF(L437=A437,\"\",\"nix\")","v":""}]
["KEN",".ke","KE",{"$f":"A438&\" \"&HLOOKUP($C$1,$E$1:$X$4910,ROW(D438))","v":"KEN Kenya"},"Kenia","Kenya ","Kenya ","Kenia","Kenya",{"$f":"\"[pt]\"&E438","v":"[pt]Kenia"},{"$f":"\"[gr]\"&E438","v":"[gr]Kenia"},"KEN",{"$f":"IF(L438=A438,\"\",\"nix\")","v":""}]
["KGZ",".kg","KG",{"$f":"A439&\" \"&HLOOKUP($C$1,$E$1:$X$4910,ROW(D439))","v":"KGZ Kyrgyzstan"},"Kirgisistan","Kirghizistan ","Kyrgyzstan ","Kirguistán","Kirghizistan",{"$f":"\"[pt]\"&E439","v":"[pt]Kirgisistan"},{"$f":"\"[gr]\"&E439","v":"[gr]Kirgisistan"},"KGZ",{"$f":"IF(L439=A439,\"\",\"nix\")","v":""}]
["KHM",".kh","KH",{"$f":"A440&\" \"&HLOOKUP($C$1,$E$1:$X$4910,ROW(D440))","v":"KHM Cambodia"},"Kambodscha","Cambogia ","Cambodia ","Camboya","Cambodge",{"$f":"\"[pt]\"&E440","v":"[pt]Kambodscha"},{"$f":"\"[gr]\"&E440","v":"[gr]Kambodscha"},"KHM",{"$f":"IF(L440=A440,\"\",\"nix\")","v":""}]
["KIR",".ki","KI",{"$f":"A441&\" \"&HLOOKUP($C$1,$E$1:$X$4910,ROW(D441))","v":"KIR Kiribati"},"Kiribati","Kiribati ","Kiribati ","Kiribati","Kiribati",{"$f":"\"[pt]\"&E441","v":"[pt]Kiribati"},{"$f":"\"[gr]\"&E441","v":"[gr]Kiribati"},"KIR",{"$f":"IF(L441=A441,\"\",\"nix\")","v":""}]
["KNA",".kn","KN",{"$f":"A442&\" \"&HLOOKUP($C$1,$E$1:$X$4910,ROW(D442))","v":"KNA Saint Kitts and Nevis"},"St. Kitts und Nevis","Saint Kitts e Nevis ","Saint Kitts and Nevis ","San Cristóbal y Nieves","Saint-Kitts-et-Nevis",{"$f":"\"[pt]\"&E442","v":"[pt]St. Kitts und Nevis"},{"$f":"\"[gr]\"&E442","v":"[gr]St. Kitts und Nevis"},"KNA",{"$f":"IF(L442=A442,\"\",\"nix\")","v":""}]
["KOR",".kr","KR",{"$f":"A443&\" \"&HLOOKUP($C$1,$E$1:$X$4910,ROW(D443))","v":"KOR Korea, Republic of"},"Korea, Republik (Südkorea)","Corea del Sud ","Korea, Republic of ","Corea del Sur","Corée du Sud",{"$f":"\"[pt]\"&E443","v":"[pt]Korea, Republik (Südkorea)"},{"$f":"\"[gr]\"&E443","v":"[gr]Korea, Republik (Südkorea)"},"KOR",{"$f":"IF(L443=A443,\"\",\"nix\")","v":""}]
["KWT",".kw","KW",{"$f":"A444&\" \"&HLOOKUP($C$1,$E$1:$X$4910,ROW(D444))","v":"KWT Kuwait"},"Kuwait","Kuwait ","Kuwait ","Kuwait","Koweït",{"$f":"\"[pt]\"&E444","v":"[pt]Kuwait"},{"$f":"\"[gr]\"&E444","v":"[gr]Kuwait"},"KWT",{"$f":"IF(L444=A444,\"\",\"nix\")","v":""}]
["LAO",".la","LA",{"$f":"A445&\" \"&HLOOKUP($C$1,$E$1:$X$4910,ROW(D445))","v":"LAO Lao People's Democratic Republic"},"Laos, Demokratische Volksrepublik","Laos ","Lao People's Democratic Republic ","Laos","Laos",{"$f":"\"[pt]\"&E445","v":"[pt]Laos, Demokratische Volksrepublik"},{"$f":"\"[gr]\"&E445","v":"[gr]Laos, Demokratische Volksrepublik"},"LAO",{"$f":"IF(L445=A445,\"\",\"nix\")","v":""}]
["LBN",".lb","LB",{"$f":"A446&\" \"&HLOOKUP($C$1,$E$1:$X$4910,ROW(D446))","v":"LBN Lebanon"},"Libanon","Libano ","Lebanon ","Líbano","Liban",{"$f":"\"[pt]\"&E446","v":"[pt]Libanon"},{"$f":"\"[gr]\"&E446","v":"[gr]Libanon"},"LBN",{"$f":"IF(L446=A446,\"\",\"nix\")","v":""}]
["LBR",".lr","LR",{"$f":"A447&\" \"&HLOOKUP($C$1,$E$1:$X$4910,ROW(D447))","v":"LBR Liberia"},"Liberia","Liberia ","Liberia ","Liberia","Libéria",{"$f":"\"[pt]\"&E447","v":"[pt]Liberia"},{"$f":"\"[gr]\"&E447","v":"[gr]Liberia"},"LBR",{"$f":"IF(L447=A447,\"\",\"nix\")","v":""}]
["LBY",".ly","LY",{"$f":"A448&\" \"&HLOOKUP($C$1,$E$1:$X$4910,ROW(D448))","v":"LBY Libya"},"Libyen","Libia ","Libya ","Libia","Libye",{"$f":"\"[pt]\"&E448","v":"[pt]Libyen"},{"$f":"\"[gr]\"&E448","v":"[gr]Libyen"},"LBY",{"$f":"IF(L448=A448,\"\",\"nix\")","v":""}]
["LCA",".lc","LC",{"$f":"A449&\" \"&HLOOKUP($C$1,$E$1:$X$4910,ROW(D449))","v":"LCA Saint Lucia"},"St. Lucia","Santa Lucia ","Saint Lucia ","Santa Lucía","Sainte-Lucie",{"$f":"\"[pt]\"&E449","v":"[pt]St. Lucia"},{"$f":"\"[gr]\"&E449","v":"[gr]St. Lucia"},"LCA",{"$f":"IF(L449=A449,\"\",\"nix\")","v":""}]
["LIE",".li","LI",{"$f":"A450&\" \"&HLOOKUP($C$1,$E$1:$X$4910,ROW(D450))","v":"LIE Liechtenstein"},"Liechtenstein","Liechtenstein ","Liechtenstein ","Liechtenstein","Liechtenstein",{"$f":"\"[pt]\"&E450","v":"[pt]Liechtenstein"},{"$f":"\"[gr]\"&E450","v":"[gr]Liechtenstein"},"LIE",{"$f":"IF(L450=A450,\"\",\"nix\")","v":""}]
["LKA",".lk","LK",{"$f":"A451&\" \"&HLOOKUP($C$1,$E$1:$X$4910,ROW(D451))","v":"LKA Sri Lanka"},"Sri Lanka","Sri Lanka ","Sri Lanka ","Sri Lanka","Sri Lanka",{"$f":"\"[pt]\"&E451","v":"[pt]Sri Lanka"},{"$f":"\"[gr]\"&E451","v":"[gr]Sri Lanka"},"LKA",{"$f":"IF(L451=A451,\"\",\"nix\")","v":""}]
["LSO",".ls","LS",{"$f":"A452&\" \"&HLOOKUP($C$1,$E$1:$X$4910,ROW(D452))","v":"LSO Lesotho"},"Lesotho","Lesotho ","Lesotho ","Lesoto","Lesotho",{"$f":"\"[pt]\"&E452","v":"[pt]Lesotho"},{"$f":"\"[gr]\"&E452","v":"[gr]Lesotho"},"LSO",{"$f":"IF(L452=A452,\"\",\"nix\")","v":""}]
["LTU",".lt","LT",{"$f":"A453&\" \"&HLOOKUP($C$1,$E$1:$X$4910,ROW(D453))","v":"LTU Lithuania"},"Litauen","Lituania ","Lithuania ","Lituania","Lituanie",{"$f":"\"[pt]\"&E453","v":"[pt]Litauen"},{"$f":"\"[gr]\"&E453","v":"[gr]Litauen"},"LTU",{"$f":"IF(L453=A453,\"\",\"nix\")","v":""}]
["LUX",".lu","LU",{"$f":"A454&\" \"&HLOOKUP($C$1,$E$1:$X$4910,ROW(D454))","v":"LUX Luxembourg"},"Luxemburg","Lussemburgo ","Luxembourg ","Luxemburgo","Luxembourg",{"$f":"\"[pt]\"&E454","v":"[pt]Luxemburg"},{"$f":"\"[gr]\"&E454","v":"[gr]Luxemburg"},"LUX",{"$f":"IF(L454=A454,\"\",\"nix\")","v":""}]
["LVA",".lv","LV",{"$f":"A455&\" \"&HLOOKUP($C$1,$E$1:$X$4910,ROW(D455))","v":"LVA Latvia"},"Lettland","Lettonia ","Latvia ","Letonia","Lettonie",{"$f":"\"[pt]\"&E455","v":"[pt]Lettland"},{"$f":"\"[gr]\"&E455","v":"[gr]Lettland"},"LVA",{"$f":"IF(L455=A455,\"\",\"nix\")","v":""}]
["MAC",".mo","MO",{"$f":"A456&\" \"&HLOOKUP($C$1,$E$1:$X$4910,ROW(D456))","v":"MAC Macao"},"Macao","Macao ","Macao ","Macao","Macao",{"$f":"\"[pt]\"&E456","v":"[pt]Macao"},{"$f":"\"[gr]\"&E456","v":"[gr]Macao"},"MAC",{"$f":"IF(L456=A456,\"\",\"nix\")","v":""}]
["MAF",".gp","MF",{"$f":"A457&\" \"&HLOOKUP($C$1,$E$1:$X$4910,ROW(D457))","v":"MAF Saint Martin (French part)"},"Saint-Martin (franz. Teil)","Saint-Martin ","Saint Martin (French part) ","San Martín","Saint-Martin",{"$f":"\"[pt]\"&E457","v":"[pt]Saint-Martin (franz. Teil)"},{"$f":"\"[gr]\"&E457","v":"[gr]Saint-Martin (franz. Teil)"},"MAF",{"$f":"IF(L457=A457,\"\",\"nix\")","v":""}]
["MAR",".ma","MA",{"$f":"A458&\" \"&HLOOKUP($C$1,$E$1:$X$4910,ROW(D458))","v":"MAR Morocco"},"Marokko","Marocco ","Morocco ","Marruecos","Maroc",{"$f":"\"[pt]\"&E458","v":"[pt]Marokko"},{"$f":"\"[gr]\"&E458","v":"[gr]Marokko"},"MAR",{"$f":"IF(L458=A458,\"\",\"nix\")","v":""}]
["MCO",".mc","MC",{"$f":"A459&\" \"&HLOOKUP($C$1,$E$1:$X$4910,ROW(D459))","v":"MCO Monaco"},"Monaco","di Monaco Monaco ","Monaco ","Mónaco","Monaco",{"$f":"\"[pt]\"&E459","v":"[pt]Monaco"},{"$f":"\"[gr]\"&E459","v":"[gr]Monaco"},"MCO",{"$f":"IF(L459=A459,\"\",\"nix\")","v":""}]
["MDA",".md","MD",{"$f":"A460&\" \"&HLOOKUP($C$1,$E$1:$X$4910,ROW(D460))","v":"MDA Moldova, Republic of"},"Moldawien (Republik Moldau)","Moldavia ","Moldova, Republic of ","Moldavia","Moldavie",{"$f":"\"[pt]\"&E460","v":"[pt]Moldawien (Republik Moldau)"},{"$f":"\"[gr]\"&E460","v":"[gr]Moldawien (Republik Moldau)"},"MDA",{"$f":"IF(L460=A460,\"\",\"nix\")","v":""}]
["MDG",".mg","MG",{"$f":"A461&\" \"&HLOOKUP($C$1,$E$1:$X$4910,ROW(D461))","v":"MDG Madagascar"},"Madagaskar","Madagascar ","Madagascar ","Madagascar","Madagascar",{"$f":"\"[pt]\"&E461","v":"[pt]Madagaskar"},{"$f":"\"[gr]\"&E461","v":"[gr]Madagaskar"},"MDG",{"$f":"IF(L461=A461,\"\",\"nix\")","v":""}]
["MDV",".mv","MV",{"$f":"A462&\" \"&HLOOKUP($C$1,$E$1:$X$4910,ROW(D462))","v":"MDV Maldives"},"Malediven","Maldive ","Maldives ","Maldivas","Maldives",{"$f":"\"[pt]\"&E462","v":"[pt]Malediven"},{"$f":"\"[gr]\"&E462","v":"[gr]Malediven"},"MDV",{"$f":"IF(L462=A462,\"\",\"nix\")","v":""}]
["MEX",".mx","MX",{"$f":"A463&\" \"&HLOOKUP($C$1,$E$1:$X$4910,ROW(D463))","v":"MEX Mexico"},"Mexiko","Messico ","Mexico ","México","Mexique",{"$f":"\"[pt]\"&E463","v":"[pt]Mexiko"},{"$f":"\"[gr]\"&E463","v":"[gr]Mexiko"},"MEX",{"$f":"IF(L463=A463,\"\",\"nix\")","v":""}]
["MHL",".mh","MH",{"$f":"A464&\" \"&HLOOKUP($C$1,$E$1:$X$4910,ROW(D464))","v":"MHL Marshall Islands"},"Marshallinseln","Isole Marshall ","Marshall Islands ","Islas Marshall","Îles Marshall",{"$f":"\"[pt]\"&E464","v":"[pt]Marshallinseln"},{"$f":"\"[gr]\"&E464","v":"[gr]Marshallinseln"},"MHL",{"$f":"IF(L464=A464,\"\",\"nix\")","v":""}]
["MKD",".mk","MK",{"$f":"A465&\" \"&HLOOKUP($C$1,$E$1:$X$4910,ROW(D465))","v":"MKD Macedonia, The Former Yugoslav Republic of"},"Mazedonien","Repubblica di Macedonia ","Macedonia, The Former Yugoslav Republic of ","República de Macedonia","Macédoine",{"$f":"\"[pt]\"&E465","v":"[pt]Mazedonien"},{"$f":"\"[gr]\"&E465","v":"[gr]Mazedonien"},"MKD",{"$f":"IF(L465=A465,\"\",\"nix\")","v":""}]
["MLI",".ml","ML",{"$f":"A466&\" \"&HLOOKUP($C$1,$E$1:$X$4910,ROW(D466))","v":"MLI Mali"},"Mali","Mali ","Mali ","Malí","Mali",{"$f":"\"[pt]\"&E466","v":"[pt]Mali"},{"$f":"\"[gr]\"&E466","v":"[gr]Mali"},"MLI",{"$f":"IF(L466=A466,\"\",\"nix\")","v":""}]
["MLT",".mt","MT",{"$f":"A467&\" \"&HLOOKUP($C$1,$E$1:$X$4910,ROW(D467))","v":"MLT Malta"},"Malta","Malta ","Malta ","Malta","Malte",{"$f":"\"[pt]\"&E467","v":"[pt]Malta"},{"$f":"\"[gr]\"&E467","v":"[gr]Malta"},"MLT",{"$f":"IF(L467=A467,\"\",\"nix\")","v":""}]
["MMR",".mm","MM",{"$f":"A468&\" \"&HLOOKUP($C$1,$E$1:$X$4910,ROW(D468))","v":"MMR Myanmar"},"Myanmar (Burma)","Birmania ","Myanmar ","Birmania","Myanmar",{"$f":"\"[pt]\"&E468","v":"[pt]Myanmar (Burma)"},{"$f":"\"[gr]\"&E468","v":"[gr]Myanmar (Burma)"},"MMR",{"$f":"IF(L468=A468,\"\",\"nix\")","v":""}]
["MNE",".me","ME",{"$f":"A469&\" \"&HLOOKUP($C$1,$E$1:$X$4910,ROW(D469))","v":"MNE Montenegro"},"Montenegro","Montenegro ","Montenegro ","Montenegro","Monténégro",{"$f":"\"[pt]\"&E469","v":"[pt]Montenegro"},{"$f":"\"[gr]\"&E469","v":"[gr]Montenegro"},"MNE",{"$f":"IF(L469=A469,\"\",\"nix\")","v":""}]
["MNG",".mn","MN",{"$f":"A470&\" \"&HLOOKUP($C$1,$E$1:$X$4910,ROW(D470))","v":"MNG Mongolia"},"Mongolei","Mongolia ","Mongolia ","Mongolia","Mongolie",{"$f":"\"[pt]\"&E470","v":"[pt]Mongolei"},{"$f":"\"[gr]\"&E470","v":"[gr]Mongolei"},"MNG",{"$f":"IF(L470=A470,\"\",\"nix\")","v":""}]
["MNP",".mp","MP",{"$f":"A471&\" \"&HLOOKUP($C$1,$E$1:$X$4910,ROW(D471))","v":"MNP Northern Mariana Islands"},"Nördliche Marianen","Isole Marianne Settentrionali ","Northern Mariana Islands ","Islas Marianas del Norte","Îles Mariannes du Nord",{"$f":"\"[pt]\"&E471","v":"[pt]Nördliche Marianen"},{"$f":"\"[gr]\"&E471","v":"[gr]Nördliche Marianen"},"MNP",{"$f":"IF(L471=A471,\"\",\"nix\")","v":""}]
["MOZ",".mz","MZ",{"$f":"A472&\" \"&HLOOKUP($C$1,$E$1:$X$4910,ROW(D472))","v":"MOZ Mozambique"},"Mosambik","Mozambico ","Mozambique ","Mozambique","Mozambique",{"$f":"\"[pt]\"&E472","v":"[pt]Mosambik"},{"$f":"\"[gr]\"&E472","v":"[gr]Mosambik"},"MOZ",{"$f":"IF(L472=A472,\"\",\"nix\")","v":""}]
["MRT",".mr","MR",{"$f":"A473&\" \"&HLOOKUP($C$1,$E$1:$X$4910,ROW(D473))","v":"MRT Mauritania"},"Mauretanien","Mauritania ","Mauritania ","Mauritania","Mauritanie",{"$f":"\"[pt]\"&E473","v":"[pt]Mauretanien"},{"$f":"\"[gr]\"&E473","v":"[gr]Mauretanien"},"MRT",{"$f":"IF(L473=A473,\"\",\"nix\")","v":""}]
["MUS",".mu","MU",{"$f":"A474&\" \"&HLOOKUP($C$1,$E$1:$X$4910,ROW(D474))","v":"MUS Mauritius"},"Mauritius","Mauritius ","Mauritius ","Mauricio","Île Maurice",{"$f":"\"[pt]\"&E474","v":"[pt]Mauritius"},{"$f":"\"[gr]\"&E474","v":"[gr]Mauritius"},"MUS",{"$f":"IF(L474=A474,\"\",\"nix\")","v":""}]
["MWI",".mw","MW",{"$f":"A475&\" \"&HLOOKUP($C$1,$E$1:$X$4910,ROW(D475))","v":"MWI Malawi"},"Malawi","Malawi ","Malawi ","Malaui","Malawi",{"$f":"\"[pt]\"&E475","v":"[pt]Malawi"},{"$f":"\"[gr]\"&E475","v":"[gr]Malawi"},"MWI",{"$f":"IF(L475=A475,\"\",\"nix\")","v":""}]
["MYS",".my","MY",{"$f":"A476&\" \"&HLOOKUP($C$1,$E$1:$X$4910,ROW(D476))","v":"MYS Malaysia"},"Malaysia","Malesia ","Malaysia ","Malasia","Malaysie",{"$f":"\"[pt]\"&E476","v":"[pt]Malaysia"},{"$f":"\"[gr]\"&E476","v":"[gr]Malaysia"},"MYS",{"$f":"IF(L476=A476,\"\",\"nix\")","v":""}]
["NAM",".na","NA",{"$f":"A477&\" \"&HLOOKUP($C$1,$E$1:$X$4910,ROW(D477))","v":"NAM Namibia"},"Namibia","Namibia ","Namibia ","Namibia","Namibie",{"$f":"\"[pt]\"&E477","v":"[pt]Namibia"},{"$f":"\"[gr]\"&E477","v":"[gr]Namibia"},"NAM",{"$f":"IF(L477=A477,\"\",\"nix\")","v":""}]
["NCL",".nc","NC",{"$f":"A478&\" \"&HLOOKUP($C$1,$E$1:$X$4910,ROW(D478))","v":"NCL New Caledonia"},"Neukaledonien","Nuova Caledonia ","New Caledonia ","Nueva Caledonia","Nouvelle-Calédonie",{"$f":"\"[pt]\"&E478","v":"[pt]Neukaledonien"},{"$f":"\"[gr]\"&E478","v":"[gr]Neukaledonien"},"NCL",{"$f":"IF(L478=A478,\"\",\"nix\")","v":""}]
["NER",".ne","NE",{"$f":"A479&\" \"&HLOOKUP($C$1,$E$1:$X$4910,ROW(D479))","v":"NER Niger"},"Niger","Niger ","Niger ","Níger","Niger",{"$f":"\"[pt]\"&E479","v":"[pt]Niger"},{"$f":"\"[gr]\"&E479","v":"[gr]Niger"},"NER",{"$f":"IF(L479=A479,\"\",\"nix\")","v":""}]
["NGA",".ng","NG",{"$f":"A480&\" \"&HLOOKUP($C$1,$E$1:$X$4910,ROW(D480))","v":"NGA Nigeria"},"Nigeria","Nigeria ","Nigeria ","Nigeria","Nigéria",{"$f":"\"[pt]\"&E480","v":"[pt]Nigeria"},{"$f":"\"[gr]\"&E480","v":"[gr]Nigeria"},"NGA",{"$f":"IF(L480=A480,\"\",\"nix\")","v":""}]
["NIC",".ni","NI",{"$f":"A481&\" \"&HLOOKUP($C$1,$E$1:$X$4910,ROW(D481))","v":"NIC Nicaragua"},"Nicaragua","Nicaragua ","Nicaragua ","Nicaragua","Nicaragua",{"$f":"\"[pt]\"&E481","v":"[pt]Nicaragua"},{"$f":"\"[gr]\"&E481","v":"[gr]Nicaragua"},"NIC",{"$f":"IF(L481=A481,\"\",\"nix\")","v":""}]
["NLD",".nl","NL",{"$f":"A482&\" \"&HLOOKUP($C$1,$E$1:$X$4910,ROW(D482))","v":"NLD Netherlands"},"Niederlande","Paesi Bassi ","Netherlands ","Países Bajos","Pays-Bas",{"$f":"\"[pt]\"&E482","v":"[pt]Niederlande"},{"$f":"\"[gr]\"&E482","v":"[gr]Niederlande"},"NLD",{"$f":"IF(L482=A482,\"\",\"nix\")","v":""}]
["NOR",".no","NO",{"$f":"A483&\" \"&HLOOKUP($C$1,$E$1:$X$4910,ROW(D483))","v":"NOR Norway"},"Norwegen","Norvegia ","Norway ","Noruega","Norvège",{"$f":"\"[pt]\"&E483","v":"[pt]Norwegen"},{"$f":"\"[gr]\"&E483","v":"[gr]Norwegen"},"NOR",{"$f":"IF(L483=A483,\"\",\"nix\")","v":""}]
["NPL",".np","NP",{"$f":"A484&\" \"&HLOOKUP($C$1,$E$1:$X$4910,ROW(D484))","v":"NPL Nepal"},"Nepal","Nepal ","Nepal ","Nepal","Népal",{"$f":"\"[pt]\"&E484","v":"[pt]Nepal"},{"$f":"\"[gr]\"&E484","v":"[gr]Nepal"},"NPL",{"$f":"IF(L484=A484,\"\",\"nix\")","v":""}]
["NRU",".nr","NR",{"$f":"A485&\" \"&HLOOKUP($C$1,$E$1:$X$4910,ROW(D485))","v":"NRU Nauru"},"Nauru","Nauru ","Nauru ","Nauru","Nauru",{"$f":"\"[pt]\"&E485","v":"[pt]Nauru"},{"$f":"\"[gr]\"&E485","v":"[gr]Nauru"},"NRU",{"$f":"IF(L485=A485,\"\",\"nix\")","v":""}]
["NZL",".nz","NZ",{"$f":"A486&\" \"&HLOOKUP($C$1,$E$1:$X$4910,ROW(D486))","v":"NZL New Zealand"},"Neuseeland","Nuova Zelanda ","New Zealand ","Nueva Zelanda","Nouvelle Zélande",{"$f":"\"[pt]\"&E486","v":"[pt]Neuseeland"},{"$f":"\"[gr]\"&E486","v":"[gr]Neuseeland"},"NZL",{"$f":"IF(L486=A486,\"\",\"nix\")","v":""}]
["OMN",".om","OM",{"$f":"A487&\" \"&HLOOKUP($C$1,$E$1:$X$4910,ROW(D487))","v":"OMN Oman"},"Oman","Oman ","Oman ","Omán","Oman",{"$f":"\"[pt]\"&E487","v":"[pt]Oman"},{"$f":"\"[gr]\"&E487","v":"[gr]Oman"},"OMN",{"$f":"IF(L487=A487,\"\",\"nix\")","v":""}]
["PAK",".pk","PK",{"$f":"A488&\" \"&HLOOKUP($C$1,$E$1:$X$4910,ROW(D488))","v":"PAK Pakistan"},"Pakistan","Pakistan ","Pakistan ","Pakistán","Pakistan",{"$f":"\"[pt]\"&E488","v":"[pt]Pakistan"},{"$f":"\"[gr]\"&E488","v":"[gr]Pakistan"},"PAK",{"$f":"IF(L488=A488,\"\",\"nix\")","v":""}]
["PAN",".pa","PA",{"$f":"A489&\" \"&HLOOKUP($C$1,$E$1:$X$4910,ROW(D489))","v":"PAN Panama"},"Panama","Panamá ","Panama ","Panamá","Panama",{"$f":"\"[pt]\"&E489","v":"[pt]Panama"},{"$f":"\"[gr]\"&E489","v":"[gr]Panama"},"PAN",{"$f":"IF(L489=A489,\"\",\"nix\")","v":""}]
["PER",".pe","PE",{"$f":"A490&\" \"&HLOOKUP($C$1,$E$1:$X$4910,ROW(D490))","v":"PER Peru"},"Peru","Perù ","Peru ","Perú","Pérou",{"$f":"\"[pt]\"&E490","v":"[pt]Peru"},{"$f":"\"[gr]\"&E490","v":"[gr]Peru"},"PER",{"$f":"IF(L490=A490,\"\",\"nix\")","v":""}]
["PHL",".ph","PH",{"$f":"A491&\" \"&HLOOKUP($C$1,$E$1:$X$4910,ROW(D491))","v":"PHL Philippines"},"Philippinen","Filippine ","Philippines ","Filipinas","Philippines",{"$f":"\"[pt]\"&E491","v":"[pt]Philippinen"},{"$f":"\"[gr]\"&E491","v":"[gr]Philippinen"},"PHL",{"$f":"IF(L491=A491,\"\",\"nix\")","v":""}]
["PLW",".pw","PW",{"$f":"A492&\" \"&HLOOKUP($C$1,$E$1:$X$4910,ROW(D492))","v":"PLW Palau"},"Palau","Palau ","Palau ","Palaos","Palaos",{"$f":"\"[pt]\"&E492","v":"[pt]Palau"},{"$f":"\"[gr]\"&E492","v":"[gr]Palau"},"PLW",{"$f":"IF(L492=A492,\"\",\"nix\")","v":""}]
["PNG",".pg","PG",{"$f":"A493&\" \"&HLOOKUP($C$1,$E$1:$X$4910,ROW(D493))","v":"PNG Papua New Guinea"},"Papua-Neuguinea","Papua Nuova Guinea ","Papua New Guinea ","Papúa Nueva Guinea","Papouasie-Nouvelle-Guinée",{"$f":"\"[pt]\"&E493","v":"[pt]Papua-Neuguinea"},{"$f":"\"[gr]\"&E493","v":"[gr]Papua-Neuguinea"},"PNG",{"$f":"IF(L493=A493,\"\",\"nix\")","v":""}]
["POL",".pl","PL",{"$f":"A494&\" \"&HLOOKUP($C$1,$E$1:$X$4910,ROW(D494))","v":"POL Poland"},"Polen","Polonia ","Poland ","Polonia","Pologne",{"$f":"\"[pt]\"&E494","v":"[pt]Polen"},{"$f":"\"[gr]\"&E494","v":"[gr]Polen"},"POL",{"$f":"IF(L494=A494,\"\",\"nix\")","v":""}]
["PRI",".pr","PR",{"$f":"A495&\" \"&HLOOKUP($C$1,$E$1:$X$4910,ROW(D495))","v":"PRI Puerto Rico"},"Puerto Rico","Porto Rico ","Puerto Rico ","Puerto Rico","Puerto Rico",{"$f":"\"[pt]\"&E495","v":"[pt]Puerto Rico"},{"$f":"\"[gr]\"&E495","v":"[gr]Puerto Rico"},"PRI",{"$f":"IF(L495=A495,\"\",\"nix\")","v":""}]
["PRK",".kp","KP",{"$f":"A496&\" \"&HLOOKUP($C$1,$E$1:$X$4910,ROW(D496))","v":"PRK Korea, Democratic People's Republic of"},"Korea, Demokratische Volksrepublik (Nordkorea)","Corea del Nord ","Korea, Democratic People's Republic of ","Corea del Norte","Corée du Nord",{"$f":"\"[pt]\"&E496","v":"[pt]Korea, Demokratische Volksrepublik (Nordkorea)"},{"$f":"\"[gr]\"&E496","v":"[gr]Korea, Demokratische Volksrepublik (Nordkorea)"},"PRK",{"$f":"IF(L496=A496,\"\",\"nix\")","v":""}]
["PRT",".pt","PT",{"$f":"A497&\" \"&HLOOKUP($C$1,$E$1:$X$4910,ROW(D497))","v":"PRT Portugal"},"Portugal","Portogallo ","Portugal ","Portugal","Portugal",{"$f":"\"[pt]\"&E497","v":"[pt]Portugal"},{"$f":"\"[gr]\"&E497","v":"[gr]Portugal"},"PRT",{"$f":"IF(L497=A497,\"\",\"nix\")","v":""}]
["PRY",".py","PY",{"$f":"A498&\" \"&HLOOKUP($C$1,$E$1:$X$4910,ROW(D498))","v":"PRY Paraguay"},"Paraguay","Paraguay ","Paraguay ","Paraguay","Paraguay",{"$f":"\"[pt]\"&E498","v":"[pt]Paraguay"},{"$f":"\"[gr]\"&E498","v":"[gr]Paraguay"},"PRY",{"$f":"IF(L498=A498,\"\",\"nix\")","v":""}]
["PSE",".ps","PS",{"$f":"A499&\" \"&HLOOKUP($C$1,$E$1:$X$4910,ROW(D499))","v":"PSE Palestinian Territory, Occupied"},"Palästinensische Autonomiegebiete","Palestina ","Palestinian Territory, Occupied ","Autoridad Nacional Palestina","Territoire Palestinien",{"$f":"\"[pt]\"&E499","v":"[pt]Palästinensische Autonomiegebiete"},{"$f":"\"[gr]\"&E499","v":"[gr]Palästinensische Autonomiegebiete"},"PSE",{"$f":"IF(L499=A499,\"\",\"nix\")","v":""}]
["PYF",".pf","PF",{"$f":"A500&\" \"&HLOOKUP($C$1,$E$1:$X$4910,ROW(D500))","v":"PYF French Polynesia"},"Französisch-Polynesien","Polinesia francese ","French Polynesia ","Polinesia Francesa","Polynésie française",{"$f":"\"[pt]\"&E500","v":"[pt]Französisch-Polynesien"},{"$f":"\"[gr]\"&E500","v":"[gr]Französisch-Polynesien"},"PYF",{"$f":"IF(L500=A500,\"\",\"nix\")","v":""}]
["QAT",".qa","QA",{"$f":"A501&\" \"&HLOOKUP($C$1,$E$1:$X$4910,ROW(D501))","v":"QAT Qatar"},"Katar","Qatar ","Qatar ","Catar","Qatar",{"$f":"\"[pt]\"&E501","v":"[pt]Katar"},{"$f":"\"[gr]\"&E501","v":"[gr]Katar"},"QAT",{"$f":"IF(L501=A501,\"\",\"nix\")","v":""}]
["ROU",".ro","RO",{"$f":"A502&\" \"&HLOOKUP($C$1,$E$1:$X$4910,ROW(D502))","v":"ROU Romania"},"Rumänien","Romania ","Romania ","Rumania","Roumanie",{"$f":"\"[pt]\"&E502","v":"[pt]Rumänien"},{"$f":"\"[gr]\"&E502","v":"[gr]Rumänien"},"ROU",{"$f":"IF(L502=A502,\"\",\"nix\")","v":""}]
["RUS",".ru","RU",{"$f":"A503&\" \"&HLOOKUP($C$1,$E$1:$X$4910,ROW(D503))","v":"RUS Russian Federation"},"Russische Föderation","Russia ","Russian Federation ","Rusia","Russie",{"$f":"\"[pt]\"&E503","v":"[pt]Russische Föderation"},{"$f":"\"[gr]\"&E503","v":"[gr]Russische Föderation"},"RUS",{"$f":"IF(L503=A503,\"\",\"nix\")","v":""}]
["RWA",".rw","RW",{"$f":"A504&\" \"&HLOOKUP($C$1,$E$1:$X$4910,ROW(D504))","v":"RWA Rwanda"},"Ruanda","Ruanda ","Rwanda ","Ruanda","Rwanda",{"$f":"\"[pt]\"&E504","v":"[pt]Ruanda"},{"$f":"\"[gr]\"&E504","v":"[gr]Ruanda"},"RWA",{"$f":"IF(L504=A504,\"\",\"nix\")","v":""}]
["SAU",".sa","SA",{"$f":"A505&\" \"&HLOOKUP($C$1,$E$1:$X$4910,ROW(D505))","v":"SAU Saudi Arabia"},"Saudi-Arabien","Arabia Saudita ","Saudi Arabia ","Arabia Saudita Arabia Saudita","Arabie Saoudite",{"$f":"\"[pt]\"&E505","v":"[pt]Saudi-Arabien"},{"$f":"\"[gr]\"&E505","v":"[gr]Saudi-Arabien"},"SAU",{"$f":"IF(L505=A505,\"\",\"nix\")","v":""}]
["SDN",".sd","SD",{"$f":"A506&\" \"&HLOOKUP($C$1,$E$1:$X$4910,ROW(D506))","v":"SDN Sudan"},"Sudan","Sudan ","Sudan ","Sudán","Soudan",{"$f":"\"[pt]\"&E506","v":"[pt]Sudan"},{"$f":"\"[gr]\"&E506","v":"[gr]Sudan"},"SDN",{"$f":"IF(L506=A506,\"\",\"nix\")","v":""}]
["SEN",".sn","SN",{"$f":"A507&\" \"&HLOOKUP($C$1,$E$1:$X$4910,ROW(D507))","v":"SEN Senegal"},"Senegal","Senegal ","Senegal ","Senegal","Sénégal",{"$f":"\"[pt]\"&E507","v":"[pt]Senegal"},{"$f":"\"[gr]\"&E507","v":"[gr]Senegal"},"SEN",{"$f":"IF(L507=A507,\"\",\"nix\")","v":""}]
["SGP",".sg","SG",{"$f":"A508&\" \"&HLOOKUP($C$1,$E$1:$X$4910,ROW(D508))","v":"SGP Singapore"},"Singapur","Singapore ","Singapore ","Singapur","Singapour",{"$f":"\"[pt]\"&E508","v":"[pt]Singapur"},{"$f":"\"[gr]\"&E508","v":"[gr]Singapur"},"SGP",{"$f":"IF(L508=A508,\"\",\"nix\")","v":""}]
["SLB",".sb","SB",{"$f":"A509&\" \"&HLOOKUP($C$1,$E$1:$X$4910,ROW(D509))","v":"SLB Solomon Islands"},"Salomonen","Isole Salomone ","Solomon Islands ","Islas Salomón","Îles Salomon",{"$f":"\"[pt]\"&E509","v":"[pt]Salomonen"},{"$f":"\"[gr]\"&E509","v":"[gr]Salomonen"},"SLB",{"$f":"IF(L509=A509,\"\",\"nix\")","v":""}]
["SLE",".sl","SL",{"$f":"A510&\" \"&HLOOKUP($C$1,$E$1:$X$4910,ROW(D510))","v":"SLE Sierra Leone"},"Sierra Leone","Sierra Leone ","Sierra Leone ","Sierra Leona","Sierra Leone",{"$f":"\"[pt]\"&E510","v":"[pt]Sierra Leone"},{"$f":"\"[gr]\"&E510","v":"[gr]Sierra Leone"},"SLE",{"$f":"IF(L510=A510,\"\",\"nix\")","v":""}]
["SLV",".sv","SV",{"$f":"A511&\" \"&HLOOKUP($C$1,$E$1:$X$4910,ROW(D511))","v":"SLV El Salvador"},"El Salvador","El Salvador ","El Salvador ","El Salvador","Le Salvador",{"$f":"\"[pt]\"&E511","v":"[pt]El Salvador"},{"$f":"\"[gr]\"&E511","v":"[gr]El Salvador"},"SLV",{"$f":"IF(L511=A511,\"\",\"nix\")","v":""}]
["SMR",".sm","SM",{"$f":"A512&\" \"&HLOOKUP($C$1,$E$1:$X$4910,ROW(D512))","v":"SMR San Marino"},"San Marino","San Marino ","San Marino ","San Marino","San Marin",{"$f":"\"[pt]\"&E512","v":"[pt]San Marino"},{"$f":"\"[gr]\"&E512","v":"[gr]San Marino"},"SMR",{"$f":"IF(L512=A512,\"\",\"nix\")","v":""}]
["SOM",".so","SO",{"$f":"A513&\" \"&HLOOKUP($C$1,$E$1:$X$4910,ROW(D513))","v":"SOM Somalia"},"Somalia","Somalia ","Somalia ","Somalia","Somalie",{"$f":"\"[pt]\"&E513","v":"[pt]Somalia"},{"$f":"\"[gr]\"&E513","v":"[gr]Somalia"},"SOM",{"$f":"IF(L513=A513,\"\",\"nix\")","v":""}]
["SRB",".rs","RS",{"$f":"A514&\" \"&HLOOKUP($C$1,$E$1:$X$4910,ROW(D514))","v":"SRB Serbia"},"Serbien","Serbia ","Serbia ","Serbia","Serbie",{"$f":"\"[pt]\"&E514","v":"[pt]Serbien"},{"$f":"\"[gr]\"&E514","v":"[gr]Serbien"},"SRB",{"$f":"IF(L514=A514,\"\",\"nix\")","v":""}]
["SSD",null,"SS",{"$f":"A515&\" \"&HLOOKUP($C$1,$E$1:$X$4910,ROW(D515))","v":"SSD South Sudan"},"Südsudan","Sudan del Sud ","South Sudan ","Sudán del Sur","Soudan du Sud",{"$f":"\"[pt]\"&E515","v":"[pt]Südsudan"},{"$f":"\"[gr]\"&E515","v":"[gr]Südsudan"},"SSD",{"$f":"IF(L515=A515,\"\",\"nix\")","v":""}]
["STP",".st","ST",{"$f":"A516&\" \"&HLOOKUP($C$1,$E$1:$X$4910,ROW(D516))","v":"STP Sao Tome and Principe"},"São Tomé und Príncipe","São Tomé e Príncipe ","Sao Tome and Principe ","Santo Tomé y Príncipe","Sao Tomé-et-Principe",{"$f":"\"[pt]\"&E516","v":"[pt]São Tomé und Príncipe"},{"$f":"\"[gr]\"&E516","v":"[gr]São Tomé und Príncipe"},"STP",{"$f":"IF(L516=A516,\"\",\"nix\")","v":""}]
["SUR",".sr","SR",{"$f":"A517&\" \"&HLOOKUP($C$1,$E$1:$X$4910,ROW(D517))","v":"SUR Suriname"},"Suriname","Suriname ","Suriname ","Surinam","Surinam",{"$f":"\"[pt]\"&E517","v":"[pt]Suriname"},{"$f":"\"[gr]\"&E517","v":"[gr]Suriname"},"SUR",{"$f":"IF(L517=A517,\"\",\"nix\")","v":""}]
["SVK",".sk","SK",{"$f":"A518&\" \"&HLOOKUP($C$1,$E$1:$X$4910,ROW(D518))","v":"SVK Slovakia"},"Slowakei","Slovacchia ","Slovakia ","Eslovaquia","Slovaquie",{"$f":"\"[pt]\"&E518","v":"[pt]Slowakei"},{"$f":"\"[gr]\"&E518","v":"[gr]Slowakei"},"SVK",{"$f":"IF(L518=A518,\"\",\"nix\")","v":""}]
["SVN",".si","SI",{"$f":"A519&\" \"&HLOOKUP($C$1,$E$1:$X$4910,ROW(D519))","v":"SVN Slovenia"},"Slowenien","Slovenia ","Slovenia ","Eslovenia","Slovénie",{"$f":"\"[pt]\"&E519","v":"[pt]Slowenien"},{"$f":"\"[gr]\"&E519","v":"[gr]Slowenien"},"SVN",{"$f":"IF(L519=A519,\"\",\"nix\")","v":""}]
["SWE",".se","SE",{"$f":"A520&\" \"&HLOOKUP($C$1,$E$1:$X$4910,ROW(D520))","v":"SWE Sweden"},"Schweden","Svezia ","Sweden ","Suecia","Suède",{"$f":"\"[pt]\"&E520","v":"[pt]Schweden"},{"$f":"\"[gr]\"&E520","v":"[gr]Schweden"},"SWE",{"$f":"IF(L520=A520,\"\",\"nix\")","v":""}]
["SWZ",".sz","SZ",{"$f":"A521&\" \"&HLOOKUP($C$1,$E$1:$X$4910,ROW(D521))","v":"SWZ Swaziland"},"Swasiland","Swaziland ","Swaziland ","Suazilandia","Swaziland",{"$f":"\"[pt]\"&E521","v":"[pt]Swasiland"},{"$f":"\"[gr]\"&E521","v":"[gr]Swasiland"},"SWZ",{"$f":"IF(L521=A521,\"\",\"nix\")","v":""}]
["SXM",".sx","SX",{"$f":"A522&\" \"&HLOOKUP($C$1,$E$1:$X$4910,ROW(D522))","v":"SXM Sint Maarten (Dutch part)"},"Sint Maarten (niederl. Teil)","Sint Maarten ","Sint Maarten (Dutch part) ","Sint Maarten","Saint-Martin",{"$f":"\"[pt]\"&E522","v":"[pt]Sint Maarten (niederl. Teil)"},{"$f":"\"[gr]\"&E522","v":"[gr]Sint Maarten (niederl. Teil)"},"SXM",{"$f":"IF(L522=A522,\"\",\"nix\")","v":""}]
["SYC",".sc","SC",{"$f":"A523&\" \"&HLOOKUP($C$1,$E$1:$X$4910,ROW(D523))","v":"SYC Seychelles"},"Seychellen","Seychelles ","Seychelles ","Seychelles","Seychelles",{"$f":"\"[pt]\"&E523","v":"[pt]Seychellen"},{"$f":"\"[gr]\"&E523","v":"[gr]Seychellen"},"SYC",{"$f":"IF(L523=A523,\"\",\"nix\")","v":""}]
["SYR",".sy","SY",{"$f":"A524&\" \"&HLOOKUP($C$1,$E$1:$X$4910,ROW(D524))","v":"SYR Syrian Arab Republic"},"Syrien, Arabische Republik","Siria ","Syrian Arab Republic ","Siria","Syrie",{"$f":"\"[pt]\"&E524","v":"[pt]Syrien, Arabische Republik"},{"$f":"\"[gr]\"&E524","v":"[gr]Syrien, Arabische Republik"},"SYR",{"$f":"IF(L524=A524,\"\",\"nix\")","v":""}]
["TCA",".tc","TC",{"$f":"A525&\" \"&HLOOKUP($C$1,$E$1:$X$4910,ROW(D525))","v":"TCA Turks and Caicos Islands"},"Turks- und Caicosinseln","Turks e Caicos ","Turks and Caicos Islands ","Islas Turcas y Caicos","Îles Turques et Caïques",{"$f":"\"[pt]\"&E525","v":"[pt]Turks- und Caicosinseln"},{"$f":"\"[gr]\"&E525","v":"[gr]Turks- und Caicosinseln"},"TCA",{"$f":"IF(L525=A525,\"\",\"nix\")","v":""}]
["TCD",".td","TD",{"$f":"A526&\" \"&HLOOKUP($C$1,$E$1:$X$4910,ROW(D526))","v":"TCD Chad"},"Tschad","Ciad ","Chad ","Chad","Tchad",{"$f":"\"[pt]\"&E526","v":"[pt]Tschad"},{"$f":"\"[gr]\"&E526","v":"[gr]Tschad"},"TCD",{"$f":"IF(L526=A526,\"\",\"nix\")","v":""}]
["TGO",".tg","TG",{"$f":"A527&\" \"&HLOOKUP($C$1,$E$1:$X$4910,ROW(D527))","v":"TGO Togo"},"Togo","Togo ","Togo ","Togo","Togo",{"$f":"\"[pt]\"&E527","v":"[pt]Togo"},{"$f":"\"[gr]\"&E527","v":"[gr]Togo"},"TGO",{"$f":"IF(L527=A527,\"\",\"nix\")","v":""}]
["THA",".th","TH",{"$f":"A528&\" \"&HLOOKUP($C$1,$E$1:$X$4910,ROW(D528))","v":"THA Thailand"},"Thailand","Thailandia ","Thailand ","Tailandia","Thaïlande",{"$f":"\"[pt]\"&E528","v":"[pt]Thailand"},{"$f":"\"[gr]\"&E528","v":"[gr]Thailand"},"THA",{"$f":"IF(L528=A528,\"\",\"nix\")","v":""}]
["TJK",".tj","TJ",{"$f":"A529&\" \"&HLOOKUP($C$1,$E$1:$X$4910,ROW(D529))","v":"TJK Tajikistan"},"Tadschikistan","Tagikistan ","Tajikistan ","Tayikistán","Tajikistan",{"$f":"\"[pt]\"&E529","v":"[pt]Tadschikistan"},{"$f":"\"[gr]\"&E529","v":"[gr]Tadschikistan"},"TJK",{"$f":"IF(L529=A529,\"\",\"nix\")","v":""}]
["TKM",".tm","TM",{"$f":"A530&\" \"&HLOOKUP($C$1,$E$1:$X$4910,ROW(D530))","v":"TKM Turkmenistan"},"Turkmenistan","Turkmenistan ","Turkmenistan ","Turkmenistán","Turkménistan",{"$f":"\"[pt]\"&E530","v":"[pt]Turkmenistan"},{"$f":"\"[gr]\"&E530","v":"[gr]Turkmenistan"},"TKM",{"$f":"IF(L530=A530,\"\",\"nix\")","v":""}]
["TLS",".tl","TL",{"$f":"A531&\" \"&HLOOKUP($C$1,$E$1:$X$4910,ROW(D531))","v":"TLS Timor-Leste"},"Osttimor (Timor-Leste)","Timor Est ","Timor-Leste ","Timor Oriental","Timor oriental",{"$f":"\"[pt]\"&E531","v":"[pt]Osttimor (Timor-Leste)"},{"$f":"\"[gr]\"&E531","v":"[gr]Osttimor (Timor-Leste)"},"TLS",{"$f":"IF(L531=A531,\"\",\"nix\")","v":""}]
["TON",".to","TO",{"$f":"A532&\" \"&HLOOKUP($C$1,$E$1:$X$4910,ROW(D532))","v":"TON Tonga"},"Tonga","Tonga ","Tonga ","Tonga","Tonga",{"$f":"\"[pt]\"&E532","v":"[pt]Tonga"},{"$f":"\"[gr]\"&E532","v":"[gr]Tonga"},"TON",{"$f":"IF(L532=A532,\"\",\"nix\")","v":""}]
["TTO",".tt","TT",{"$f":"A533&\" \"&HLOOKUP($C$1,$E$1:$X$4910,ROW(D533))","v":"TTO Trinidad and Tobago"},"Trinidad und Tobago","Trinidad e Tobago ","Trinidad and Tobago ","Trinidad y Tobago","Trinité et Tobago",{"$f":"\"[pt]\"&E533","v":"[pt]Trinidad und Tobago"},{"$f":"\"[gr]\"&E533","v":"[gr]Trinidad und Tobago"},"TTO",{"$f":"IF(L533=A533,\"\",\"nix\")","v":""}]
["TUN",".tn","TN",{"$f":"A534&\" \"&HLOOKUP($C$1,$E$1:$X$4910,ROW(D534))","v":"TUN Tunisia"},"Tunesien","Tunisia ","Tunisia ","Túnez","Tunisie",{"$f":"\"[pt]\"&E534","v":"[pt]Tunesien"},{"$f":"\"[gr]\"&E534","v":"[gr]Tunesien"},"TUN",{"$f":"IF(L534=A534,\"\",\"nix\")","v":""}]
["TUR",".tr","TR",{"$f":"A535&\" \"&HLOOKUP($C$1,$E$1:$X$4910,ROW(D535))","v":"TUR Turkey"},"Türkei","Turchia ","Turkey ","Turquía","Turquie",{"$f":"\"[pt]\"&E535","v":"[pt]Türkei"},{"$f":"\"[gr]\"&E535","v":"[gr]Türkei"},"TUR",{"$f":"IF(L535=A535,\"\",\"nix\")","v":""}]
["TUV",".tv","TV",{"$f":"A536&\" \"&HLOOKUP($C$1,$E$1:$X$4910,ROW(D536))","v":"TUV Tuvalu"},"Tuvalu","Tuvalu ","Tuvalu ","Tuvalu","Tuvalu",{"$f":"\"[pt]\"&E536","v":"[pt]Tuvalu"},{"$f":"\"[gr]\"&E536","v":"[gr]Tuvalu"},"TUV",{"$f":"IF(L536=A536,\"\",\"nix\")","v":""}]
["TZA",".tz","TZ",{"$f":"A537&\" \"&HLOOKUP($C$1,$E$1:$X$4910,ROW(D537))","v":"TZA Tanzania, United Republic of"},"Tansania, Vereinigte Republik","Tanzania ","Tanzania, United Republic of ","Tanzania","Tanzanie",{"$f":"\"[pt]\"&E537","v":"[pt]Tansania, Vereinigte Republik"},{"$f":"\"[gr]\"&E537","v":"[gr]Tansania, Vereinigte Republik"},"TZA",{"$f":"IF(L537=A537,\"\",\"nix\")","v":""}]
["UGA",".ug","UG",{"$f":"A538&\" \"&HLOOKUP($C$1,$E$1:$X$4910,ROW(D538))","v":"UGA Uganda"},"Uganda","Uganda ","Uganda ","Uganda","Ouganda",{"$f":"\"[pt]\"&E538","v":"[pt]Uganda"},{"$f":"\"[gr]\"&E538","v":"[gr]Uganda"},"UGA",{"$f":"IF(L538=A538,\"\",\"nix\")","v":""}]
["UKR",".ua","UA",{"$f":"A539&\" \"&HLOOKUP($C$1,$E$1:$X$4910,ROW(D539))","v":"UKR Ukraine"},"Ukraine","Ucraina ","Ukraine ","Ucrania","Ukraine",{"$f":"\"[pt]\"&E539","v":"[pt]Ukraine"},{"$f":"\"[gr]\"&E539","v":"[gr]Ukraine"},"UKR",{"$f":"IF(L539=A539,\"\",\"nix\")","v":""}]
["URY",".uy","UY",{"$f":"A540&\" \"&HLOOKUP($C$1,$E$1:$X$4910,ROW(D540))","v":"URY Uruguay"},"Uruguay","Uruguay ","Uruguay ","Uruguay","Uruguay",{"$f":"\"[pt]\"&E540","v":"[pt]Uruguay"},{"$f":"\"[gr]\"&E540","v":"[gr]Uruguay"},"URY",{"$f":"IF(L540=A540,\"\",\"nix\")","v":""}]
["USA",".us","US",{"$f":"A541&\" \"&HLOOKUP($C$1,$E$1:$X$4910,ROW(D541))","v":"USA United States"},"Vereinigte Staaten von Amerika","Stati Uniti d'America ","United States ","Estados Unidos","États-Unis (USA)",{"$f":"\"[pt]\"&E541","v":"[pt]Vereinigte Staaten von Amerika"},{"$f":"\"[gr]\"&E541","v":"[gr]Vereinigte Staaten von Amerika"},"USA",{"$f":"IF(L541=A541,\"\",\"nix\")","v":""}]
["UZB",".uz","UZ",{"$f":"A542&\" \"&HLOOKUP($C$1,$E$1:$X$4910,ROW(D542))","v":"UZB Uzbekistan"},"Usbekistan","Uzbekistan ","Uzbekistan ","Uzbekistán","Ouzbékistan",{"$f":"\"[pt]\"&E542","v":"[pt]Usbekistan"},{"$f":"\"[gr]\"&E542","v":"[gr]Usbekistan"},"UZB",{"$f":"IF(L542=A542,\"\",\"nix\")","v":""}]
["VCT",".vc","VC",{"$f":"A543&\" \"&HLOOKUP($C$1,$E$1:$X$4910,ROW(D543))","v":"VCT Saint Vincent and the Grenadines"},"St. Vincent und die Grenadinen","Saint Vincent e Grenadine ","Saint Vincent and the Grenadines ","San Vicente y las Granadinas","Saint-Vincent-et-les-Grenadines",{"$f":"\"[pt]\"&E543","v":"[pt]St. Vincent und die Grenadinen"},{"$f":"\"[gr]\"&E543","v":"[gr]St. Vincent und die Grenadinen"},"VCT",{"$f":"IF(L543=A543,\"\",\"nix\")","v":""}]
["VEN",".ve","VE",{"$f":"A544&\" \"&HLOOKUP($C$1,$E$1:$X$4910,ROW(D544))","v":"VEN Venezuela, Bolivarian Republic of"},"Venezuela","Venezuela ","Venezuela, Bolivarian Republic of ","Venezuela","Vénézuela",{"$f":"\"[pt]\"&E544","v":"[pt]Venezuela"},{"$f":"\"[gr]\"&E544","v":"[gr]Venezuela"},"VEN",{"$f":"IF(L544=A544,\"\",\"nix\")","v":""}]
["VGB",".vg","VG",{"$f":"A545&\" \"&HLOOKUP($C$1,$E$1:$X$4910,ROW(D545))","v":"VGB Virgin Islands, British"},"Britische Jungferninseln","Isole Vergini britanniche ","Virgin Islands, British ","Islas Vírgenes Británicas","Îles Vierges britanniques",{"$f":"\"[pt]\"&E545","v":"[pt]Britische Jungferninseln"},{"$f":"\"[gr]\"&E545","v":"[gr]Britische Jungferninseln"},"VGB",{"$f":"IF(L545=A545,\"\",\"nix\")","v":""}]
["VIR",".vi","VI",{"$f":"A546&\" \"&HLOOKUP($C$1,$E$1:$X$4910,ROW(D546))","v":"VIR Virgin Islands, U.S."},"Amerikanische Jungferninseln","Isole Vergini americane ","Virgin Islands, U.S. ","Islas Vírgenes de los Estados Unidos","Îles Vierges des États-Unis",{"$f":"\"[pt]\"&E546","v":"[pt]Amerikanische Jungferninseln"},{"$f":"\"[gr]\"&E546","v":"[gr]Amerikanische Jungferninseln"},"VIR",{"$f":"IF(L546=A546,\"\",\"nix\")","v":""}]
["VNM",".vn","VN",{"$f":"A547&\" \"&HLOOKUP($C$1,$E$1:$X$4910,ROW(D547))","v":"VNM Viet Nam"},"Vietnam","Vietnam ","Viet Nam ","Vietnam","Vietnam",{"$f":"\"[pt]\"&E547","v":"[pt]Vietnam"},{"$f":"\"[gr]\"&E547","v":"[gr]Vietnam"},"VNM",{"$f":"IF(L547=A547,\"\",\"nix\")","v":""}]
["VUT",".vu","VU",{"$f":"A548&\" \"&HLOOKUP($C$1,$E$1:$X$4910,ROW(D548))","v":"VUT Vanuatu"},"Vanuatu","Vanuatu ","Vanuatu ","Vanuatu","Vanuatu",{"$f":"\"[pt]\"&E548","v":"[pt]Vanuatu"},{"$f":"\"[gr]\"&E548","v":"[gr]Vanuatu"},"VUT",{"$f":"IF(L548=A548,\"\",\"nix\")","v":""}]
["WSM",".ws","WS",{"$f":"A549&\" \"&HLOOKUP($C$1,$E$1:$X$4910,ROW(D549))","v":"WSM Samoa"},"Samoa","Samoa ","Samoa ","Samoa","Samoa",{"$f":"\"[pt]\"&E549","v":"[pt]Samoa"},{"$f":"\"[gr]\"&E549","v":"[gr]Samoa"},"WSM",{"$f":"IF(L549=A549,\"\",\"nix\")","v":""}]
["XKX",null,"XK",{"$f":"A550&\" \"&HLOOKUP($C$1,$E$1:$X$4910,ROW(D550))","v":"XKX Kosovo"},"Kosovo","Kosovo","Kosovo","Kosovo","Kosovo",{"$f":"\"[pt]\"&E550","v":"[pt]Kosovo"},{"$f":"\"[gr]\"&E550","v":"[gr]Kosovo"},"XKX",{"$f":"IF(L550=A550,\"\",\"nix\")","v":""}]
["YEM",".ye","YE",{"$f":"A551&\" \"&HLOOKUP($C$1,$E$1:$X$4910,ROW(D551))","v":"YEM Yemen"},"Jemen","Yemen ","Yemen ","Yemen","Yemen",{"$f":"\"[pt]\"&E551","v":"[pt]Jemen"},{"$f":"\"[gr]\"&E551","v":"[gr]Jemen"},"YEM",{"$f":"IF(L551=A551,\"\",\"nix\")","v":""}]
["ZAF",".za","ZA",{"$f":"A552&\" \"&HLOOKUP($C$1,$E$1:$X$4910,ROW(D552))","v":"ZAF South Africa"},"Südafrika","Sudafrica ","South Africa ","Sudáfrica","Afrique du Sud",{"$f":"\"[pt]\"&E552","v":"[pt]Südafrika"},{"$f":"\"[gr]\"&E552","v":"[gr]Südafrika"},"ZAF",{"$f":"IF(L552=A552,\"\",\"nix\")","v":""}]
["ZMB",".zm","ZM",{"$f":"A553&\" \"&HLOOKUP($C$1,$E$1:$X$4910,ROW(D553))","v":"ZMB Zambia"},"Sambia","Zambia ","Zambia ","Zambia","Zambie",{"$f":"\"[pt]\"&E553","v":"[pt]Sambia"},{"$f":"\"[gr]\"&E553","v":"[gr]Sambia"},"ZMB",{"$f":"IF(L553=A553,\"\",\"nix\")","v":""}]
["ZWE",".zw","ZW",{"$f":"A554&\" \"&HLOOKUP($C$1,$E$1:$X$4910,ROW(D554))","v":"ZWE Zimbabwe"},"Simbabwe","Zimbabwe ","Zimbabwe ","Zimbabue","Zimbabwe",{"$f":"\"[pt]\"&E554","v":"[pt]Simbabwe"},{"$f":"\"[gr]\"&E554","v":"[gr]Simbabwe"},"ZWE",{"$f":"IF(L554=A554,\"\",\"nix\")","v":""}]
[{"$nulls":3},{"$f":"HLOOKUP($C$1,$E$1:$X$4910,ROW(D555))","v":"Average Africa"},"Durchschnitt Afrika","media Africa","Average Africa","Media África",null,{"$f":"\"[pt]\"&E555","v":"[pt]Durchschnitt Afrika"},{"$f":"\"[gr]\"&E555","v":"[gr]Durchschnitt Afrika"},"Average Africa",{"$f":"IF(L555=A555,\"\",\"nix\")","v":"nix"}]
[{"$nulls":3},{"$f":"HLOOKUP($C$1,$E$1:$X$4910,ROW(D556))","v":"Average Americas"},"Durchschnitt Amerika","media America","Average Americas","Media Américas",null,{"$f":"\"[pt]\"&E556","v":"[pt]Durchschnitt Amerika"},{"$f":"\"[gr]\"&E556","v":"[gr]Durchschnitt Amerika"},"Average Americas",{"$f":"IF(L556=A556,\"\",\"nix\")","v":"nix"}]
[{"$nulls":3},{"$f":"HLOOKUP($C$1,$E$1:$X$4910,ROW(D557))","v":"Average Asia"},"Durchschnitt Asien","media Asia","Average Asia","Media Asia",null,{"$f":"\"[pt]\"&E557","v":"[pt]Durchschnitt Asien"},{"$f":"\"[gr]\"&E557","v":"[gr]Durchschnitt Asien"},"Average Asia",{"$f":"IF(L557=A557,\"\",\"nix\")","v":"nix"}]
[{"$nulls":3},{"$f":"HLOOKUP($C$1,$E$1:$X$4910,ROW(D558))","v":"Average Europe"},"Durchschnitt Europa","media Europa","Average Europe","Media Europa",null,{"$f":"\"[pt]\"&E558","v":"[pt]Durchschnitt Europa"},{"$f":"\"[gr]\"&E558","v":"[gr]Durchschnitt Europa"},"Average Europe",{"$f":"IF(L558=A558,\"\",\"nix\")","v":"nix"}]
[{"$nulls":3},{"$f":"HLOOKUP($C$1,$E$1:$X$4910,ROW(D559))","v":"Average Oceania"},"Durchschnitt Ozeanien","media Ozeania","Average Oceania","Media Oceanía",null,{"$f":"\"[pt]\"&E559","v":"[pt]Durchschnitt Ozeanien"},{"$f":"\"[gr]\"&E559","v":"[gr]Durchschnitt Ozeanien"},"Average Oceania",{"$f":"IF(L559=A559,\"\",\"nix\")","v":"nix"}]
[{"$nulls":3},{"$f":"HLOOKUP($C$1,$E$1:$X$4910,ROW(D560))","v":0},"Durchschnitt Welt","media mondo",null,"Media Mundo",null,{"$f":"\"[pt]\"&E560","v":"[pt]Durchschnitt Welt"},{"$f":"\"[gr]\"&E560","v":"[gr]Durchschnitt Welt"},"World",{"$f":"IF(L560=A560,\"\",\"nix\")","v":"nix"}]
[{"$nulls":3},{"$f":"HLOOKUP($C$1,$E$1:$X$4910,ROW(D561))","v":0},"Überwiegende Herkunft restlicher Lieferanten","provenienza prevalente del resto dei fornitori",null,"Origen predominante del resto de proveedores",{"$nulls":4},{"$f":"IF(L561=A561,\"\",\"nix\")","v":""}]